Phenol, 4-cyclohexyl-

Phase change data

Data compiled as indicated in comments:
BS - Robert L. Brown and Stephen E. Stein
TRC - Thermodynamics Research Center, NIST Boulder Laboratories, Chris Muzny director

Quantity Value Units Method Reference Comment
Tfus403.8KN/AWhite and Bishop, 1940Uncertainty assigned by TRC = 0.5 K; TRC

Reduced pressure boiling point

Tboil (K) Pressure (bar) Reference Comment
406.70.005Weast and Grasselli, 1989BS

In addition to the Thermodynamics Research Center (TRC) data available from this site, much more physical and chemical property data is available from the following TRC products:

References

White and Bishop, 1940
White, A.H.; Bishop, W.S., Dielectric Evidence of Molecular Rotation in the Crystals of Certain Non-aromatic Compounds, J. Am. Chem. Soc., 1940, 62, 8-16. [all data]

Weast and Grasselli, 1989
CRC Handbook of Data on Organic Compounds, 2nd Editon, Weast,R.C and Grasselli, J.G., ed(s)., CRC Press, Inc., Boca Raton, FL, 1989, 1. [all data]