Octadecane, 1-isocyanato-

Condensed phase thermochemistry data

Data compiled by: Hussein Y. Afeefy, Joel F. Liebman, and Stephen E. Stein

Quantity Value Units Method Reference Comment
Δfsolid-147.8 ± 1.0kcal/molCcbSelivanov and Konstantinov, 1975Authors hf298_condensed=-13.7±1.0 kcal/mol
Quantity Value Units Method Reference Comment
Δcsolid-2903.0 ± 1.0kcal/molCcbSelivanov and Konstantinov, 1975Authors hf298_condensed=-13.7±1.0 kcal/mol

References

Selivanov and Konstantinov, 1975
Selivanov, V.D.; Konstantinov, I.I., Thermochemistry of chloroaryl isocyanates, Russ. J. Phys. Chem. (Engl. Transl.), 1975, 49, 620-621. [all data]