Benzoic acid, 3-chloro-, ethyl ester

Kovats' RI, non-polar column, isothermal

View large format table.

Column type Active phase Temperature (C) I Reference Comment
CapillarySE-30140.1317.Korhonen and Lind, 1985
CapillarySE-30160.1318.Korhonen and Lind, 1985
CapillarySE-30180.1335.Korhonen and Lind, 1985
CapillarySE-30160.1323.Korhonen and Lind, 1985, 2N2; Column length: 25. m; Column diameter: 0.33 mm
CapillarySE-30180.1331.Korhonen and Lind, 1985, 2N2; Column length: 25. m; Column diameter: 0.33 mm
CapillarySE-30200.1340.Korhonen and Lind, 1985, 2N2; Column length: 25. m; Column diameter: 0.33 mm

Kovats' RI, polar column, isothermal

View large format table.

Column type Active phase Temperature (C) I Reference Comment
CapillaryOV-351160.1887.Korhonen and Lind, 1985, 2N2; Column length: 25. m; Column diameter: 0.32 mm
CapillaryOV-351180.1893.Korhonen and Lind, 1985, 2N2; Column length: 25. m; Column diameter: 0.32 mm
CapillaryOV-351200.1909.Korhonen and Lind, 1985, 2N2; Column length: 25. m; Column diameter: 0.32 mm

Van Den Dool and Kratz RI, non-polar column, temperature ramp

View large format table.

Column type Active phase I Reference Comment
CapillarySE-301316.Korhonen and Lind, 198510. K/min; Tstart: 100. C; Tend: 280. C
CapillarySE-301316.Korhonen and Lind, 19852. K/min; Tstart: 100. C; Tend: 280. C
CapillarySE-301305.Korhonen and Lind, 19856. K/min; Tstart: 100. C; Tend: 280. C
CapillarySE-301318.Korhonen and Lind, 1985, 2N2, 10. K/min; Column length: 25. m; Column diameter: 0.33 mm; Tstart: 100. C; Tend: 320. C
CapillarySE-301305.Korhonen and Lind, 1985, 2N2, 2. K/min; Column length: 25. m; Column diameter: 0.33 mm; Tstart: 100. C; Tend: 320. C
CapillarySE-301314.Korhonen and Lind, 1985, 2N2, 6. K/min; Column length: 25. m; Column diameter: 0.33 mm; Tstart: 100. C; Tend: 320. C

Van Den Dool and Kratz RI, polar column, temperature ramp

View large format table.

Column type Active phase I Reference Comment
CapillaryOV-3511863.Korhonen and Lind, 1985, 2N2, 10. K/min; Column length: 25. m; Column diameter: 0.32 mm; Tstart: 100. C; Tend: 230. C
CapillaryOV-3511832.Korhonen and Lind, 1985, 2N2, 2. K/min; Column length: 25. m; Column diameter: 0.32 mm; Tstart: 100. C; Tend: 230. C
CapillaryOV-3511850.Korhonen and Lind, 1985, 2N2, 6. K/min; Column length: 25. m; Column diameter: 0.32 mm; Tstart: 100. C; Tend: 230. C

References

Korhonen and Lind, 1985
Korhonen, I.O.O.; Lind, M.A., Gas-liquid chromatographic analyses. XLI. Ethyl and ω-chloroethyl esters of benzoic and monochlorobenzoic acids on SE-30 and OV-351 capillary columns, J. Chromatogr., 1985, 325, 433-443, https://doi.org/10.1016/S0021-9673(00)96054-0 . [all data]

Korhonen and Lind, 1985, 2
Korhonen, I.O.O.; Lind, M.A., Gas-liquid chromatographic analyses. XXXV. Capillary column studies of C1-C12 n-alkyl esters of benzoic and monochlorobenzoic acids, J. Chromatogr., 1985, 322, 83-96, https://doi.org/10.1016/S0021-9673(01)97661-7 . [all data]