3,5-dichloro-2-(trichloromethyl)pyridine

Phase change data

Data compiled by: Hussein Y. Afeefy, Joel F. Liebman, and Stephen E. Stein

Quantity Value Units Method Reference Comment
Δvap13.45kcal/molVBessarab, Emel'yanov, et al., 1983

References

Bessarab, Emel'yanov, et al., 1983
Bessarab, N.A.; Emel'yanov, V.L.; Stul, B.Ya.; Platonov, V.A.; Simulin, Yu.N.; Dzhagatspanyan, R.V., Vapor pressure of some chlorine derivatives of 2-picoline, Deposited Document, VINITI 2994-83. Chem. Abst. 101:43847c, 1983, 1-7. [all data]