1,4-Dimethylazulene

Normal alkane RI, non-polar column, temperature ramp

Data compiled by: NIST Mass Spectrometry Data Center, William E. Wallace, director

Column type CapillaryCapillaryCapillaryCapillary
Active phase ZB-1CP Sil 5 CBZB-1DB-1
Column length (m) 30.25.30.50.
Carrier gas NitrogenH2N2N2
Substrate
Column diameter (mm) 0.25 0.250.25
Phase thickness (μm) 0.25 0.250.25
Tstart (C) 45.50.45.95.
Tend (C) 230.230.230.240.
Heat rate (K/min) 3.3.3.4.
Initial hold (min)
Final hold (min)
I 1517.1528.1517.1523.
ReferenceMierendorff, Stahl-Biskup, et al., 2008Adio, 2005Mierendorff, Stahl-Biskup, et al., 2003Velasco-Negueruela, Pérez-Alonso, et al., 2002
Comment MSDC-RI MSDC-RI MSDC-RI MSDC-RI

Normal alkane RI, polar column, custom temperature program

Data compiled by: NIST Mass Spectrometry Data Center, William E. Wallace, director

Column type CapillaryCapillary
Active phase HP-Innowax FSCHP-Innowax FSC
Column length (m) 60.60.
Carrier gas He
Substrate
Column diameter (mm) 0.250.25
Phase thickness (μm) 0.250.25
Program 60C(10min) => 4C/min => 220C(10min) => 1C/min => 240C60C(10min) => 4C/min => 220C (10min) => 1C/min => 240C
I 2291.2291.
ReferenceTabanca N., Demirci B., et al., 2007Tabanca, Demirci, et al., 2006
Comment MSDC-RI MSDC-RI

References

Mierendorff, Stahl-Biskup, et al., 2008
Mierendorff, H.-G.; Stahl-Biskup, E.; Posthumus, M.A.; van Beek, T.A., Composition of commercial Cape chamomile oil (Eriocephalus punctuatus / Eriocephalus tenuifolius), 2008, retrieved from http://www.chemische-analysen-hamburg.de/Publikationen?CapeChamomileOil/. [all data]

Adio, 2005
Adio, A.M., Isolation and structure elucidation of sesquiterpenoids from the essential oils of some liverworths (Hepaticae), Dissertation, Hamburg University, 2005, 265. [all data]

Mierendorff, Stahl-Biskup, et al., 2003
Mierendorff, H.-G.; Stahl-Biskup, E.; Posthumus, M.A.; van Beek, T.A., Composition of commercial Cape chamomile oil (Eriocephalus punctulatus), Flavour Fragr. J., 2003, 18, 6, 510-514, https://doi.org/10.1002/ffj.1259 . [all data]

Velasco-Negueruela, Pérez-Alonso, et al., 2002
Velasco-Negueruela, A.; Pérez-Alonso, M.J.; de Paz, P.L.P.; Vallejo, C.G.; Palá-Paúl, J.; Iñigo, A., Chemical composition of the essential oils from the roots, fruits, leaves and stems of Pimpinella cumbrae link growing in the Canary Islands (Spain), Flavour Fragr. J., 2002, 17, 6, 468-471, https://doi.org/10.1002/ffj.1131 . [all data]