n-Tridecan-1-ol
- Formula: C13H28O
- Molecular weight: 200.3608
- IUPAC Standard InChIKey: XFRVVPUIAFSTFO-UHFFFAOYSA-N
- CAS Registry Number: 112-70-9
- Chemical structure:

Condensed phase thermochemistry data

Data compiled as indicated in comments:
DH - Eugene S. Domalski and Elizabeth D. Hearing
ALS - Hussein Y. Afeefy, Joel F. Liebman, and Stephen E. Stein
Quantity | Value | Units | Method | Reference | Comment |
---|---|---|---|---|---|
ΔfH°solid | -599.5 ± 0.9 | kJ/mol | Ccb | Mosselman and Dekker, 1975 | ALS |
Quantity | Value | Units | Method | Reference | Comment |
ΔcH°solid | -8517.8 ± 0.9 | kJ/mol | Ccb | Mosselman and Dekker, 1975 | Corresponding ΔfHºsolid = -599.5 kJ/mol (simple calculation by NIST; no Washburn corrections); ALS |
Constant pressure heat capacity of liquid
Cp,liquid (J/mol*K) | Temperature (K) | Reference | Comment |
---|---|---|---|
487.5 | 313.15 | Khasanshin and Zykova, 1989 | T = 313 to 553 K.; DH |
476. | 305. | Mosselman, Mourik, et al., 1974 | T = 305 to 346 K.; DH |
Constant pressure heat capacity of solid
Cp,solid (J/mol*K) | Temperature (K) | Reference | Comment |
---|---|---|---|
378. | 298.15 | Mosselman, Mourik, et al., 1974 | β-form, 276 to 299 K.; DH |

Phase change data

Data compiled as indicated in comments:
BS - Robert L. Brown and Stephen E. Stein
TRC - Thermodynamics Research Center, NIST Boulder Laboratories, Chris Muzny director
AC - William E. Acree, Jr., James S. Chickos
DH - Eugene S. Domalski and Elizabeth D. Hearing
Quantity | Value | Units | Method | Reference | Comment |
---|---|---|---|---|---|
Tfus | 303.05 | K | N/A | Gaikwad and Subrahmanyam, 1985 | Uncertainty assigned by TRC = 0.5 K; TRC |
Tfus | 301.7 | K | N/A | Belousov, Bubnov, et al., 1977 | Uncertainty assigned by TRC = 1. K; TRC |
Tfus | 304.89 | K | N/A | Mosselman, Mourik, et al., 1974, 2 | Crystal phase 3 phase; Uncertainty assigned by TRC = 0.05 K; TRC |
Tfus | 304.63 | K | N/A | Mosselman, Mourik, et al., 1974, 2 | Crystal phase 2 phase; Uncertainty assigned by TRC = 0.04 K; TRC |
Tfus | 303.50 | K | N/A | Mosselman, Mourik, et al., 1974, 2 | Crystal phase 1 phase; Uncertainty assigned by TRC = 0.05 K; TRC |
Quantity | Value | Units | Method | Reference | Comment |
ΔvapH° | 94.7 ± 0.4 | kJ/mol | CGC | Nichols, Kweskin, et al., 2006 | AC |
ΔvapH° | 95.8 | kJ/mol | GS | Kulikov, Verevkin, et al., 2001 | Based on data from 307. to 348. K.; AC |
Reduced pressure boiling point
Tboil (K) | Pressure (bar) | Reference | Comment |
---|---|---|---|
428.7 | 0.020 | Aldrich Chemical Company Inc., 1990 | BS |
Enthalpy of vaporization
ΔvapH (kJ/mol) | Temperature (K) | Method | Reference | Comment |
---|---|---|---|---|
91.1 | 327. | GS | Kulikov, Verevkin, et al., 2001 | Based on data from 307. to 348. K.; AC |
87.4 | 343. | N/A | N'Guimbi, Kasehgari, et al., 1992 | Based on data from 313. to 373. K.; AC |
69.2 | 446. | A | Stephenson and Malanowski, 1987 | Based on data from 431. to 568. K.; AC |
Enthalpy of fusion
ΔfusH (kJ/mol) | Temperature (K) | Reference | Comment |
---|---|---|---|
44.78 | 304.7 | van Miltenburg, van den Berg, et al., 2003 | AC |
18.74 | 306.6 | Mosselman, Mourik, et al., 1974 | AC |
Enthalpy of phase transition
ΔHtrs (kJ/mol) | Temperature (K) | Initial Phase | Final Phase | Reference | Comment |
---|---|---|---|---|---|
3.600 | 301.6 | crystaline, β | crystaline, | Mosselman, Mourik, et al., 1974 | DH |
22.100 | 305.8 | crystaline, β | crystaline, α | Mosselman, Mourik, et al., 1974 | DH |
45.120 | 304.6 | crystaline, β | liquid | Mosselman, Mourik, et al., 1974 | DH |
23.000 | 303.5 | crystaline, α | liquid | Mosselman, Mourik, et al., 1974 | DH |
Entropy of phase transition
ΔStrs (J/mol*K) | Temperature (K) | Initial Phase | Final Phase | Reference | Comment |
---|---|---|---|---|---|
11.9 | 301.6 | crystaline, β | crystaline, | Mosselman, Mourik, et al., 1974 | DH |
72.3 | 305.8 | crystaline, β | crystaline, α | Mosselman, Mourik, et al., 1974 | DH |
148.1 | 304.6 | crystaline, β | liquid | Mosselman, Mourik, et al., 1974 | DH |

Kovats' RI, non-polar column, isothermal

View large format table.

Column type Active phase Temperature (C) I Reference Comment
PackedOV-101220.1563.6Didaoui, Touabet, et al., 1997N2, Chromosorb G HP; Column length: 2. m
CapillarySE-30200.1585.5Didaoui, Touabet, et al., 199727. m/0.4 mm/0.1 μm, N2, Chromosorb G HP
CapillaryCP Sil 5 CB240.1577.Hanai and Hong, 198930. m/0.25 mm/0.25 μm
CapillaryDB-1240.1565.Hanai and Hong, 198930. m/0.25 mm/0.25 μm

Kovats' RI, non-polar column, temperature ramp

View large format table.

Column type Active phase I Reference Comment
CapillaryOV-1011560.Ohnishi and Shibamoto, 19842. K/min; Column length: 50. m; Column diameter: 0.23 mm; Tstart: 80. C; Tend: 200. C
CapillaryOV-1011563.Ohnishi and Shibamoto, 19842. K/min; Column length: 50. m; Column diameter: 0.23 mm; Tstart: 80. C; Tend: 200. C

Kovats' RI, polar column, isothermal

View large format table.

Column type Active phase Temperature (C) I Reference Comment
CapillaryCP-Wax240.2033.Hanai and Hong, 198925. m/0.25 mm/0.22 μm
CapillaryDB-Wax240.2074.Hanai and Hong, 198925. m/0.25 mm/0.22 μm

Van Den Dool and Kratz RI, non-polar column, temperature ramp

View large format table.

Column type Active phase I Reference Comment
CapillaryHP-5MS1575.Skaltsa, Mavrommati, et al., 200130. m/0.25 mm/0.25 μm, He, 60. C @ 5. min, 4. K/min; Tend: 280. C
CapillaryHP-51572.Lazari, Skaltsa, et al., 200030. m/0.25 mm/0.25 μm, He, 50. C @ 5. min, 4. K/min; Tend: 280. C

Van Den Dool and Kratz RI, non-polar column, custom temperature program

View large format table.

Column type Active phase I Reference Comment
CapillaryVF-5MS1585.3Zheng and White, 200830. m/0.25 mm/0.25 μm, He; Program: not specified

Van Den Dool and Kratz RI, polar column, custom temperature program

View large format table.

Column type Active phase I Reference Comment
CapillarySupelcowax-102076.Sing, Smadja, et al., 199260. m/0.25 mm/0.25 μm, He; Program: 20C(0.5min) => 60C => 4C/min => 250C

Normal alkane RI, non-polar column, temperature ramp

View large format table.

Column type Active phase I Reference Comment
CapillaryRTX-11580.Bendiabdellah, El Amine Dib, et al., 201260. m/0.22 mm/0.25 μm, Helium, 2. K/min, 230. C @ 5. min; Tstart: 60. C
CapillaryRTX-11580.Bendiabdellah, El Amine Dib, et al., 201260. m/0.22 mm/0.25 μm, Helium, 2. K/min, 230. C @ 5. min; Tstart: 60. C
CapillaryHP-5 MS1556.Sadashava, Sharanappa, et al., 201030. m/0.25 mm/0.25 μm, Helium, 5. K/min; Tstart: 50. C; Tend: 240. C
CapillaryHP-51585.Saidana, Mahjoub, et al., 200830. m/0.25 mm/0.25 μm, Nitrogen, 50. C @ 1. min, 5. K/min, 280. C @ 1. min
CapillaryDB-51593.Gogus, Ozel, et al., 200760. m/0.32 mm/1.0 μm, Helium, 35. C @ 7. min, 15. K/min, 240. C @ 10. min
CapillaryHP-1011547.Jerkovic, Mastelic, et al., 200725. m/0.2 mm/0.2 μm, He, 70. C @ 2. min, 3. K/min; Tend: 200. C
CapillaryRSL-2001577.Jirovetz, Buchbauer, et al., 200230. m/0.32 mm/0.25 μm, H2, 40. C @ 5. min, 6. K/min, 280. C @ 5. min
CapillaryRSL-2001577.Jirovetz, Smith, et al., 200230. m/0.25 mm/0.25 μm, H2, 40. C @ 2. min, 6. K/min, 280. C @ 10. min
CapillaryDB-51569.Limberger, Simões-Pires, et al., 200230. m/0.25 mm/0.25 μm, He, 3. K/min; Tstart: 60. C; Tend: 250. C
CapillaryUltra-21577.King, Matthews, et al., 199550. m/0.32 mm/0.52 μm, He, 40. C @ 3. min, 4. K/min, 250. C @ 30. min

Normal alkane RI, non-polar column, custom temperature program

View large format table.

Column type Active phase I Reference Comment
CapillaryRTX-11586.Bendiabdellah, El Amine Dib, et al., 201260. m/0.22 mm/0.25 μm, Helium; Program: not specified
CapillaryRTX-11586.Bendiabdellah, El Amine Dib, et al., 201260. m/0.22 mm/0.25 μm, Helium; Program: not specified
CapillaryBPX-51585.se Souza, Cardeal, et al., 200930. m/0.25 mm/0.25 μm, Helium; Program: 35 0C (5 min) 3 0C/min -> 210 0C 40 0C/min -> 240 0C (10 min)
CapillaryBPX-51577.se Souza, Cardeal, et al., 200930. m/0.25 mm/0.25 μm, Helium; Program: not specified
CapillaryDB-51572.Nivinsliene, Butkiene, et al., 200750. m/0.32 mm/0.25 μm, Helium; Program: 60 0C (1 min) 5 0C/min -> 160 0C 10 0C/min -> 250 0C
CapillaryHP-5MS1580.Alissandrakis, Kibaris, et al., 200530. m/0.25 mm/0.25 μm, He; Program: 40C(3min) => 2C/min => 180C => 10C/min => 250C(5min)
CapillaryBPX-51577.Machiels, van Ruth, et al., 200360. m/0.32 mm/1. μm, He; Program: 40C (4min) => 2C/min => 90C => 4C/min => 130C => 8C/min => 250 C (10min)
CapillaryCP Sil 5 CB1565.Weyerstahl, Marschall, et al., 1999Column length: 25. m; Column diameter: 0.39 mm; Program: not specified
CapillarySE-541599.Um, Bailey, et al., 1992He; Column length: 50. m; Column diameter: 0.32 mm; Program: 35 0C (5 min) 8 0C/min -> 200 0C 2 0C/min -> 250 0C

Normal alkane RI, polar column, temperature ramp

View large format table.

Column type Active phase I Reference Comment
CapillaryRTX-Wax2034.Bendiabdellah, El Amine Dib, et al., 201260. m/0.22 mm/0.25 μm, Helium, 2. K/min, 230. C @ 5. min; Tstart: 60. C
CapillaryDB-Wax2093.Tamura, Boonbumrung, et al., 2000Nitrogen, 40. C @ 10. min, 2. K/min; Column length: 60. m; Column diameter: 0.25 mm; Tend: 200. C
CapillaryCarbowax 20M2041.Kawakami, Kobayashi, et al., 1993He, 60. C @ 4. min, 2. K/min; Column length: 50. m; Column diameter: 0.25 mm; Tend: 180. C
CapillaryCarbowax 20M2041.Kawakami and Kobayashi, 1991He, 60. C @ 4. min, 2. K/min; Column length: 50. m; Column diameter: 0.25 mm; Tend: 180. C

Normal alkane RI, polar column, custom temperature program

View large format table.

Column type Active phase I Reference Comment
CapillaryInnowax FSC2077.Bardakci, Demirci, et al., 201260. m/0.25 mm/0.25 μm, Helium; Program: 60 0C (10 min) 4 0C/min -> 220 0C 1 0C/min -> 240 0C
CapillaryDB-Wax2063.Welke, Manfroi, et al., 201230. m/0.25 mm/0.25 μm, Helium; Program: not specified
CapillaryDB-Wax2078.Welke, Manfroi, et al., 201230. m/0.25 mm/0.25 μm, Helium; Program: not specified
CapillaryHP-Innowax FSC2077.Demirci, Baser, et al., 200360. m/0.25 mm/0.25 μm, He; Program: 60C (10min) => 4C/min => 220C (10min) => 1C/min => 240C

Lee's RI, non-polar column, temperature ramp

View large format table.

Column type Active phase I Reference Comment
CapillaryDB-5MS266.83Chen, Keeran, et al., 200230. m/0.25 mm/0.5 μm, 40. C @ 1. min, 10. K/min; Tend: 310. C
CapillaryDB-5MS268.36Chen, Keeran, et al., 200230. m/0.25 mm/0.5 μm, 40. C @ 1. min, 4. K/min; Tend: 310. C

Lee's RI, non-polar column, custom temperature program

View large format table.

Column type Active phase I Reference Comment
CapillaryDB-5220.2Fuentes, Font, et al., 2007Column length: 60. m; Program: not specified

References

Mosselman and Dekker, 1975
Mosselman, C.; Dekker, H.,
Enthalpies of formation of n-alkan-1-ols,
J. Chem. Soc. Faraday Trans. 1, 1975, 417-424. [all data]
Khasanshin and Zykova, 1989
Khasanshin, T.S.; Zykova, T.B.,
Specific heat of saturated monatomic alcohols,
Inzh. -Fiz. Zhur., 1989, 56(6), 991-994. [all data]
Mosselman, Mourik, et al., 1974
Mosselman, C.; Mourik, J.; Dekker, H.,
Enthalpies of phase change and heat capacities of some long-chain alcohols. Adiabatic semi-microcalorimeter for studies of polymorphism,
J. Chem. Thermodynam., 1974, 6, 477-487. [all data]
Gaikwad and Subrahmanyam, 1985
Gaikwad, B.R.; Subrahmanyam, V.V.,
Melting behavior of fatty alcohols and their binary blends.,
J. Indian Chem. Soc., 1985, 62, 513. [all data]
Belousov, Bubnov, et al., 1977
Belousov, V.P.; Bubnov, V.I.; Pfestorf, R.; Schumichen, A.,
Calorimetric characteristics of selected nonelectrotype systems. Additional experimental measurement of enthalpy of mixing in systems of n- alkylanine-aromatic & n-alchohol-aromatic,
Z. Chem., 1977, 17, 382. [all data]
Mosselman, Mourik, et al., 1974, 2
Mosselman, C.; Mourik, J.; Dekker, H.,
Enthalpies of phase change and heat capacities of some long-chain alcohols. Adiabatic semi-microcalorimeter for studies of polymorphism,
J. Chem. Thermodyn., 1974, 6, 477-87. [all data]
Nichols, Kweskin, et al., 2006
Nichols, Gary; Kweskin, Sasha; Frericks, Margaret; Reiter, Sarah; Wang, Gin; Orf, Jennifer; Carvallo, Brett; Hillesheim, Dorothea; Chickos, James,
Evaluation of the Vaporization, Fusion, and Sublimation Enthalpies of the 1-Alkanols: The Vaporization Enthalpy of 1-, 6-, 7-, and 9-Heptadecanol, 1-Octadecanol, 1-Eicosanol, 1-Docosanol, 1-Hexacosanol, and Cholesterol at T = 298.15 K by Correlation Gas Chromatography,
J. Chem. Eng. Data, 2006, 51, 2, 475-482, https://doi.org/10.1021/je0503857
. [all data]
Kulikov, Verevkin, et al., 2001
Kulikov, Dmitry; Verevkin, Sergey P.; Heintz, Andreas,
Enthalpies of vaporization of a series of aliphatic alcohols,
Fluid Phase Equilibria, 2001, 192, 1-2, 187-207, https://doi.org/10.1016/S0378-3812(01)00633-1
. [all data]
Aldrich Chemical Company Inc., 1990
Aldrich Chemical Company Inc.,
Catalog Handbook of Fine Chemicals, Aldrich Chemical Company, Inc., Milwaukee WI, 1990, 1. [all data]
N'Guimbi, Kasehgari, et al., 1992
N'Guimbi, J.; Kasehgari, H.; Mokbel, I.; Jose, J.,
Tensions de vapeur d'alcools primaires dans le domaine 0,3 Pa à 1,5 kPa,
Thermochimica Acta, 1992, 196, 2, 367-377, https://doi.org/10.1016/0040-6031(92)80100-B
. [all data]
Stephenson and Malanowski, 1987
Stephenson, Richard M.; Malanowski, Stanislaw,
Handbook of the Thermodynamics of Organic Compounds, 1987, https://doi.org/10.1007/978-94-009-3173-2
. [all data]
van Miltenburg, van den Berg, et al., 2003
van Miltenburg, J. Cees; van den Berg, Gerrit.J.K.; Ramirez, Marius,
Heat Capacities and Derived Thermodynamic Functions of 1-Dodecanol and 1-Tridecanol between 10 K and 370 K and Heat Capacities of 1-Pentadecanol and 1-Heptadecanol between 300 K and 380 K and Correlations for the Heat Capacity and the Entropy of Liquid n -Alcohols,
J. Chem. Eng. Data, 2003, 48, 1, 36-43, https://doi.org/10.1021/je025524o
. [all data]