Cyclohexanol, 2-methyl-5-(1-methylethyl)-, (1α,2α,5β)-

Kovats' RI, polar column, isothermal

View large format table.

Column type Active phase Temperature (C) I Reference Comment
PackedPEG 4000175.1732.Hedin, Thompson, et al., 1972N2, Chromosorb P; Column length: 6.145 m

References

Hedin, Thompson, et al., 1972
Hedin, P.A.; Thompson, A.C.; Gueldner, R.C., Application of a Sequential Reduction Regimen to Fractionation of Essential Oils, Anal. Chem., 1972, 44, 7, 1254-1257, https://doi.org/10.1021/ac60315a030 . [all data]