Tetraethylene glycol

Condensed phase thermochemistry data

Data compiled as indicated in comments:
ALS - Hussein Y. Afeefy, Joel F. Liebman, and Stephen E. Stein
DH - Eugene S. Domalski and Elizabeth D. Hearing

Quantity Value Units Method Reference Comment
Δfliquid-981.7 ± 4.6kJ/molCcbMoureu and Dode, 1937Reanalyzed by Cox and Pilcher, 1970, Original value = -982.0 kJ/mol; ALS
Quantity Value Units Method Reference Comment
Δcliquid-4738.8 ± 4.6kJ/molCcbMoureu and Dode, 1937Reanalyzed by Cox and Pilcher, 1970, Original value = -4740.9 kJ/mol; Corresponding Δfliquid = -981.73 kJ/mol (simple calculation by NIST; no Washburn corrections); ALS

Constant pressure heat capacity of liquid

Cp,liquid (J/mol*K) Temperature (K) Reference Comment
428.8298.Zaripov, 1982T = 298, 323, 363 K.; DH
419.2298.Stephens and Tamplin, 1979T = 273 to 533 K.; DH

Phase change data

Data compiled as indicated in comments:
BS - Robert L. Brown and Stephen E. Stein
TRC - Thermodynamics Research Center, NIST Boulder Laboratories, Chris Muzny director
AC - William E. Acree, Jr., James S. Chickos
ALS - Hussein Y. Afeefy, Joel F. Liebman, and Stephen E. Stein

Quantity Value Units Method Reference Comment
Tboil587.2KN/AAldrich Chemical Company Inc., 1990BS
Tboil601.2KN/AWeast and Grasselli, 1989BS
Quantity Value Units Method Reference Comment
Tfus263.75KN/AGallaugher and Hibbert, 1936Uncertainty assigned by TRC = 0.7 K; TRC
Quantity Value Units Method Reference Comment
Tc800.KN/ANikitin, Pavlov, et al., 1995Uncertainty assigned by TRC = 30. K; TRC
Tc762.KN/AStephens and Tamplin, 1979, 2Uncertainty assigned by TRC = 20. K; TC data from Union Carbide Corp.; TRC
Quantity Value Units Method Reference Comment
Pc32.00barN/ANikitin, Pavlov, et al., 1995Uncertainty assigned by TRC = 1.00 bar; TRC

Enthalpy of vaporization

ΔvapH (kJ/mol) Temperature (K) Method Reference Comment
92.2441.AStephenson and Malanowski, 1987Based on data from 426. - 581. K. See also Stull, 1947.; AC
99. ± 10.273.VGallaugher and Hibbert, 1937Reanalyzed by Pedley, Naylor, et al., 1986, Original value = 89.16 kJ/mol; ALS

Antoine Equation Parameters

log10(P) = A − (B / (T + C))
    P = vapor pressure (bar)
    T = temperature (K)

View plot Requires a JavaScript / HTML 5 canvas capable browser.

Temperature (K) A B C Reference Comment
427.1 - 580.98.199534837.3679.636Stull, 1947Coefficents calculated by NIST from author's data.

In addition to the Thermodynamics Research Center (TRC) data available from this site, much more physical and chemical property data is available from the following TRC products:

Van Den Dool and Kratz RI, non-polar column, temperature ramp

View large format table.

Column type Active phase I Reference Comment
CapillaryUltra-21507.Poskrobko, Linkiewicz, et al., 199425. m/0.32 mm/0.52 μm, H2, 8. K/min; Tstart: 50. C; Tend: 310. C

Van Den Dool and Kratz RI, non-polar column, custom temperature program

View large format table.

Column type Active phase I Reference Comment
CapillaryVF-5MS1515.4Zheng and White, 200830. m/0.25 mm/0.25 μm, He; Program: not specified

References

Moureu and Dode, 1937
Moureu, H.; Dode, M., Chaleurs de formation de l'oxyde d'ethylene, de l'ethanediol et de quelques homologues, Bull. Soc. Chim. France, 1937, 4, 637-647. [all data]

Cox and Pilcher, 1970
Cox, J.D.; Pilcher, G., Thermochemistry of Organic and Organometallic Compounds, Academic Press, New York, 1970, 1-636. [all data]

Zaripov, 1982
Zaripov, Z.I., Experimental study of the isobaric heat capacity of liquid organic compounds with molecular weights of up to 4000 a.e.m., 1982, Teplomassoobmen Teplofiz. [all data]

Stephens and Tamplin, 1979
Stephens, M.A.; Tamplin, W.S., Saturated liquid specific heats of ethylene glycol homologues, J. Chem. Eng. Data, 1979, 24, 81-82. [all data]

Aldrich Chemical Company Inc., 1990
Aldrich Chemical Company Inc., Catalog Handbook of Fine Chemicals, Aldrich Chemical Company, Inc., Milwaukee WI, 1990, 1. [all data]

Weast and Grasselli, 1989
CRC Handbook of Data on Organic Compounds, 2nd Editon, Weast,R.C and Grasselli, J.G., ed(s)., CRC Press, Inc., Boca Raton, FL, 1989, 1. [all data]

Gallaugher and Hibbert, 1936
Gallaugher, A.F.; Hibbert, H., Studies on reactions relating to carbohydrates and polysaccharides: xlix molecular weight, molar refraction, freezing point and other properties of the polyethylene glycols and their derivatives, J. Am. Chem. Soc., 1936, 58, 813. [all data]

Nikitin, Pavlov, et al., 1995
Nikitin, E.D.; Pavlov, P.A.; Popov, A.P., (Gas + liquid) critical temperatures and pressures of polyethene glycols for HOCH2CH2OH to H(OCH2CH2)v.apprxeq.13.2OH, J. Chem. Thermodyn., 1995, 27, 43-51. [all data]

Stephens and Tamplin, 1979, 2
Stephens, M.A.; Tamplin, W.S., Saturated Liquid SPecific Heats of Ethylene GLycol Homologues, J. Chem. Eng. Data, 1979, 24, 81-2. [all data]

Stephenson and Malanowski, 1987
Stephenson, Richard M.; Malanowski, Stanislaw, Handbook of the Thermodynamics of Organic Compounds, 1987, https://doi.org/10.1007/978-94-009-3173-2 . [all data]

Stull, 1947
Stull, Daniel R., Vapor Pressure of Pure Substances. Organic and Inorganic Compounds, Ind. Eng. Chem., 1947, 39, 4, 517-540, https://doi.org/10.1021/ie50448a022 . [all data]

Gallaugher and Hibbert, 1937
Gallaugher, A.F.; Hibbert, H., Studies on reactions relating to carbohydrates and polysaccharides. LV. Vapor pressures of the polyethylene glycols and their derivatives, J. Am. Chem. Soc., 1937, 59, 2521-2525. [all data]

Pedley, Naylor, et al., 1986
Pedley, J.B.; Naylor, R.D.; Kirby, S.P., Thermochemical Data of Organic Compounds, Chapman and Hall, New York, 1986, 1-792. [all data]