1H-Pyrazole, 1-phenyl-

Phase change data

Data compiled as indicated in comments:
BS - Robert L. Brown and Stephen E. Stein
AC - William E. Acree, Jr., James S. Chickos

Quantity Value Units Method Reference Comment
Δvap70.2 ± 3.4kJ/molCRibeiro da Silva, Ribeiro da Silva, et al., 2000AC

Reduced pressure boiling point

Tboil (K) Pressure (bar) Reference Comment
414.70.040Aldrich Chemical Company Inc., 1990BS

References

Ribeiro da Silva, Ribeiro da Silva, et al., 2000
Ribeiro da Silva, Manuel A.V.; Ribeiro da Silva, Maria das Dores M.C.; Matos, M. Agostinha R.; Jiménez, Pilar; Victoria Roux, M.; Martin-Luengo, M.A.; Elguero, José; Claramunt, Rosa; Cabildo, Pilar, Enthalpies of combustion, heat capacities,and enthalpies of vaporisation of 1-phenylimidazole and 1-phenylpyrazole, The Journal of Chemical Thermodynamics, 2000, 32, 2, 237-245, https://doi.org/10.1006/jcht.1999.0605 . [all data]

Aldrich Chemical Company Inc., 1990
Aldrich Chemical Company Inc., Catalog Handbook of Fine Chemicals, Aldrich Chemical Company, Inc., Milwaukee WI, 1990, 1. [all data]