4,1,3-Ethanediylidenecyclopenta[cd,gh]pentalene-6,7(1H)-dione, decahydro-

Gas phase ion energetics data

Data compiled by: Sharon G. Lias and Joel F. Liebman

Ionization energy determinations

IE (eV) Method Reference Comment
8.6PEAlbert, Elsasser, et al., 1991
8.8PEAlbert, Elsasser, et al., 1991Vertical value

References

Albert, Elsasser, et al., 1991
Albert, B.; Elsasser, D.; Heckel, D.; Kopmeier, S.; Martin, H.; Mayer, B.; Chow, T.J.; Wu, T.; Yeh, S., Syntheses, photoelectron spectra, and photoreactivity of polycyclic 1,5-diketones: Transannular interaction in the cyclooctane-1,5-dione fragment, Chem. Ber., 1991, 124, 803. [all data]