Ethanol, 2-[2-(2-ethoxyethoxy)ethoxy]-

Kovats' RI, non-polar column, isothermal

View large format table.

Column type Active phase Temperature (C) I Reference Comment
PackedApiezon L170.1198.Singliar and Dykyj, 1969

Van Den Dool and Kratz RI, non-polar column, custom temperature program

View large format table.

Column type Active phase I Reference Comment
CapillaryVF-5MS1287.3Zheng and White, 200830. m/0.25 mm/0.25 μm, He; Program: not specified

References

Singliar and Dykyj, 1969
Singliar, M.; Dykyj, J., Gas chromatography of glycol ethers, Collect. Czech. Chem. Commun., 1969, 34, 3, 767-775, https://doi.org/10.1135/cccc19690767 . [all data]

Zheng and White, 2008
Zheng, Y.; White, E., Retention Data. NIST Mass Spectrometry Data Center., NIST Mass Spectrometry Data Center, 2008. [all data]