Acetamide, N-cyclohexyl-

Kovats' RI, non-polar column, isothermal

View large format table.

Column type Active phase Temperature (C) I Reference Comment
PackedSE-30180.1313.Krawczyk and Piotrowski, 1989N2, Chromosorb W AW; Column length: 1. m
PackedApiezon L150.1268.Zhuravleva I.L., Golovnya R.V., et al., 1978N2, Chromosorb G-AW; Column length: 2.7 m

Kovats' RI, polar column, isothermal

View large format table.

Column type Active phase Temperature (C) I Reference Comment
PackedPolyethylene Glycol150.2113.Zhuravleva I.L., Golovnya R.V., et al., 1978N2, Chromosorb G-AW; Column length: 2.7 m

References

Krawczyk and Piotrowski, 1989
Krawczyk, W.; Piotrowski, G.T., Relationships Between Structure and Retention Index for N-Substituted Amides of Aliphatic Acids on a Non-Polar Column, J. Chromatogr., 1989, 463, 297-304, https://doi.org/10.1016/S0021-9673(01)84484-8 . [all data]

Zhuravleva I.L., Golovnya R.V., et al., 1978
Zhuravleva I.L.; Golovnya R.V.; Palamarchuk L.F.; Kishkovskii Z.N., Gas-chromatographic determination of N-monoalkylacetamides, J. Anal. Chem. USSR (Engl. Transl.), 1978, 33, 11, 1717-1719. [all data]