Pyridine, 4-nitro-, 1-oxide

Gas phase thermochemistry data

Data compiled by: Hussein Y. Afeefy, Joel F. Liebman, and Stephen E. Stein

Quantity Value Units Method Reference Comment
Δfgas126.0 ± 0.9kJ/molCcbAcree, Tucker, et al., 1995

Condensed phase thermochemistry data

Data compiled by: Hussein Y. Afeefy, Joel F. Liebman, and Stephen E. Stein

Quantity Value Units Method Reference Comment
Δfsolid17.1 ± 0.8kJ/molCcbAcree, Tucker, et al., 1995
Δfsolid11.7 ± 1.7kJ/molCcbLebedev, Chironov, et al., 1995
Quantity Value Units Method Reference Comment
Δcsolid-2556.3 ± 0.5kJ/molCcbAcree, Tucker, et al., 1995
Δcsolid-2551.0 ± 1.7kJ/molCcbLebedev, Chironov, et al., 1995

Phase change data

Data compiled as indicated in comments:
ALS - Hussein Y. Afeefy, Joel F. Liebman, and Stephen E. Stein
AC - William E. Acree, Jr., James S. Chickos

Quantity Value Units Method Reference Comment
Δsub108.9 ± 0.3kJ/molVAcree, Tucker, et al., 1995ALS
Δsub108.9 ± 0.3kJ/molCAcree Jr., 1995AC
Δsub89.1 ± 2.5kJ/molVLebedev, Chironov, et al., 1995ALS

Enthalpy of sublimation

ΔsubH (kJ/mol) Temperature (K) Reference Comment
89.1 ± 2.5311. - 335.Lebedev, Chironov, et al., 1995, 2AC

Gas phase ion energetics data

Data evaluated by: Edward P. Hunter and Sharon G. Lias

Quantity Value Units Method Reference Comment
Proton affinity (review)868.0kJ/molN/AHunter and Lias, 1998
Quantity Value Units Method Reference Comment
Gas basicity837.3kJ/molN/AHunter and Lias, 1998

References

Acree, Tucker, et al., 1995
Acree, W.E., Jr.; Tucker, S.A.; Ribeiro da Silva, M.D.M.C.; Matos, M.A.R.; Goncalves, J.M.; Ribeiro da Silva, M.A.V.; Pilcher, G., Enthalpies of combustion of 4-nitropyridine N-oxide and pyridine-3-carboxylic acid N-oxide: the dissociation enthalpies of the N-O bonds in pyridine N-oxide derivatives, J. Chem. Thermodyn., 1995, 27, 391-398. [all data]

Lebedev, Chironov, et al., 1995
Lebedev, V.P.; Chironov, V.V.; Kizin, A.N.; Falyahov, I.F.; Saifullin, I.Sh.; Klyuchnikov, O.R.; Orlov, Yu.D.; Lebedev, Yu.A., The energies of dissociation of the N-O bonds in pyridine 1-oxide deriveates, Russ. Chem. Bull. (Engl. Transl.), 1995, 44, 639-641. [all data]

Acree Jr., 1995
Acree Jr., Enthalpies of combustion of 4-nitropyridineN-oxide and pyridine-3-carboxylic acidN-oxide: the dissociation enthalpies of the N---O bonds in pyridineN-oxide derivatives, The Journal of Chemical Thermodynamics, 1995, 27, 4, 391-398, https://doi.org/10.1006/jcht.1995.0038 . [all data]

Lebedev, Chironov, et al., 1995, 2
Lebedev, V.P.; Chironov, V.V.; Kizin, A.N.; Falyakhov, I.F.; Saifullin, I.Sh.; Klyushnikov, O.R.; Orlov, Yu.D.; Lebedev, Yu.A., Dissociation energy of the N-O bond in pyridine 1-oxide derivatives, Izv. Akad. Nauk Ser. Khim., 1995, 4, 660. [all data]