Cyclohexane, 1-methyl-4-(1-methylethylidene)-

Kovats' RI, non-polar column, isothermal

View large format table.

Column type Active phase Temperature (C) I Reference Comment
CapillarySE-3080.1025.9Albaigés and Guardino, 1980He; Column length: 64. m; Column diameter: 0.25 mm
CapillarySqualane80.1018.Albaigés and Guardino, 1980He; Column length: 100. m; Column diameter: 0.25 mm
PackedSE-30160.998.Hedin, Thompson, et al., 1972N2, Chromosorb W; Column length: 6.145 m

Kovats' RI, polar column, isothermal

View large format table.

Column type Active phase Temperature (C) I Reference Comment
PackedPEG 4000175.1220.Hedin, Thompson, et al., 1972N2, Chromosorb P; Column length: 6.145 m

Normal alkane RI, non-polar column, custom temperature program

View large format table.

Column type Active phase I Reference Comment
CapillaryOV-1, SE-30, Methyl silicone, SP-2100, OV-101, DB-1, etc.998.Waggott and Davies, 1984Hydrogen; Column length: 50. m; Column diameter: 0.32 mm; Program: not specified

References

Albaigés and Guardino, 1980
Albaigés, J.; Guardino, X., Gas chromatographic-mass spectrometric identification of alkylcyclohexanes and cyclohexenes, Chromatographia, 1980, 13, 12, 755-762, https://doi.org/10.1007/BF02265555 . [all data]

Hedin, Thompson, et al., 1972
Hedin, P.A.; Thompson, A.C.; Gueldner, R.C., Application of a Sequential Reduction Regimen to Fractionation of Essential Oils, Anal. Chem., 1972, 44, 7, 1254-1257, https://doi.org/10.1021/ac60315a030 . [all data]

Waggott and Davies, 1984
Waggott, A.; Davies, I.W., Identification of organic pollutants using linear temperature programmed retention indices (LTPRIs) - Part II, 1984, retrieved from http://dwi.defra.gov.uk/research/completed-research/reports/dwi0383.pdf. [all data]