Ethanone, 1-(4-pyridinyl)-

Phase change data

Data compiled as indicated in comments:
BS - Robert L. Brown and Stephen E. Stein
AC - William E. Acree, Jr., James S. Chickos

Quantity Value Units Method Reference Comment
Tboil485.2KN/AWeast and Grasselli, 1989BS
Tboil487.KN/AAmerican Tokyo Kasei, 1988BS
Tboil485. - 487.KN/ABuckingham and Donaghy, 1982BS
Quantity Value Units Method Reference Comment
Δvap15.9 ± 0.2kcal/molCFreitas, Oliveira, et al., 2007AC

References

Weast and Grasselli, 1989
CRC Handbook of Data on Organic Compounds, 2nd Editon, Weast,R.C and Grasselli, J.G., ed(s)., CRC Press, Inc., Boca Raton, FL, 1989, 1. [all data]

American Tokyo Kasei, 1988
American Tokyo Kasei, TCI American Organic Chemical 88/89 Catalog, American Tokyo Kasei, Portland, OR, 1988, 1610. [all data]

Buckingham and Donaghy, 1982
Buckingham, J.; Donaghy, S.M., Dictionary of Organic Compounds: Fifth Edition, Chapman and Hall, New York, 1982, 1. [all data]

Freitas, Oliveira, et al., 2007
Freitas, Vera L.S.; Oliveira, Liliana I.P.; Ribeiro da Silva, Maria D.M.C., Standard molar enthalpies of formation of the acetylpyridine isomers, The Journal of Chemical Thermodynamics, 2007, 39, 1, 39-43, https://doi.org/10.1016/j.jct.2006.06.004 . [all data]