2,4,5-Trimethylpyridine

Kovats' RI, non-polar column, isothermal

View large format table.

Column type Active phase Temperature (C) I Reference Comment
CapillaryOV-101110.1066.Zhuravleva, Terenina, et al., 199040. m/0.27 mm/0.4 μm
PackedApiezon L130.1084.Shatts, Avots, et al., 1977He, Chromosorb W AW-DMCS; Column length: 2.4 m

Kovats' RI, polar column, isothermal

View large format table.

Column type Active phase Temperature (C) I Reference Comment
CapillaryPEG-40M110.1507.Zhuravleva, Terenina, et al., 199040. m/0.22 mm/0.40 μm

Normal alkane RI, non-polar column, temperature ramp

View large format table.

Column type Active phase I Reference Comment
CapillarySE-301053.9Bur'yan and Nabivach, 19921.7 K/min; Tstart: 82. C; Tend: 177. C

Normal alkane RI, non-polar column, custom temperature program

View large format table.

Column type Active phase I Reference Comment
CapillarySE-301071.Li, Gao, et al., 2000Program: not specified

Phase change data

Data compiled by: Thermodynamics Research Center, NIST Boulder Laboratories, Chris Muzny director

Quantity Value Units Method Reference Comment
Tboil456.65KN/AProstakov, Gaivoronskaya, et al., 1963Uncertainty assigned by TRC = 5. K

In addition to the Thermodynamics Research Center (TRC) data available from this site, much more physical and chemical property data is available from the following TRC products:

References

Zhuravleva, Terenina, et al., 1990
Zhuravleva, I.L.; Terenina, M.B.; Shenderyuk, V.V.; Golovnya, R.V., Capillary chromatography. Calculation of retention indices of alkylpyridines on the basis of non-equal energy contributions of identical alkyl groups, Zh. Anal. Khim., 1990, 45, 722-729. [all data]

Shatts, Avots, et al., 1977
Shatts, V.D.; Avots, A.A.; Belikov, V.A., Retention indices of alkylpyridines, Zh. Anal. Khim., 1977, 32, 4, 631-638. [all data]

Bur'yan and Nabivach, 1992
Bur'yan, P.; Nabivach, V.M., Investigation of composition of higher heterocnitrogen bases of brown coal tar, Coke Chem. (Engl. Transl.), 1992, 5, 29-33. [all data]

Li, Gao, et al., 2000
Li, R.; Gao, S.-G.; Xiang, B.-R., Using improved BP neural network in predicting GC retention indices, Computers appl. chem. (Chinese), 2000, 17, 1-2, 113-114. [all data]