Glutarimide

Gas phase thermochemistry data

Data compiled by: Hussein Y. Afeefy, Joel F. Liebman, and Stephen E. Stein

Quantity Value Units Method Reference Comment
Δfgas-393.6 ± 1.8kJ/molCcbYan and Pilcher, 1990

Condensed phase thermochemistry data

Data compiled by: Hussein Y. Afeefy, Joel F. Liebman, and Stephen E. Stein

Quantity Value Units Method Reference Comment
Δfsolid-487.7 ± 0.8kJ/molCcbYan and Pilcher, 1990
Quantity Value Units Method Reference Comment
Δcsolid-2480.3 ± 0.5kJ/molCcbYan and Pilcher, 1990

Phase change data

Data compiled as indicated in comments:
AC - William E. Acree, Jr., James S. Chickos
ALS - Hussein Y. Afeefy, Joel F. Liebman, and Stephen E. Stein

Quantity Value Units Method Reference Comment
Δsub94.1 ± 1.6kJ/molN/AMeng-Yan and Pilcher, 1990AC
Δsub94.1 ± 1.6kJ/molCYan and Pilcher, 1990ALS

Enthalpy of sublimation

ΔsubH (kJ/mol) Temperature (K) Method Reference Comment
93.6 ± 1.6329.MEMeng-Yan and Pilcher, 1990Based on data from 317. - 340. K.; AC

References

Yan and Pilcher, 1990
Yan, Y.M.; Pilcher, G., Enthalpies of combustion of succinic anhydride, glutaric anhydride, and glutarimide, J. Chem. Thermodyn., 1990, 22, 893-898. [all data]

Meng-Yan and Pilcher, 1990
Meng-Yan, Yang; Pilcher, G., Enthalpies of combustion of succinic anhydride, glutaric anhydride, and glutarimide, The Journal of Chemical Thermodynamics, 1990, 22, 9, 893-898, https://doi.org/10.1016/0021-9614(90)90177-R . [all data]