1-Dodecanamine, N,N-dimethyl-

Van Den Dool and Kratz RI, non-polar column, temperature ramp

Data compiled by: NIST Mass Spectrometry Data Center, William E. Wallace, director

Column type Capillary
Active phase 5 % Phenyl methyl siloxane
Column length (m) 30.
Carrier gas He
Substrate
Column diameter (mm) 0.25
Phase thickness (μm) 1.
Tstart (C) 40.
Tend (C) 250.
Heat rate (K/min) 7.
Initial hold (min) 10.
Final hold (min) 5.
I 1529.
ReferenceEstevez, Ventanas, et al., 2005
Comment MSDC-RI

Normal alkane RI, non-polar column, custom temperature program

Data compiled by: NIST Mass Spectrometry Data Center, William E. Wallace, director

Column type Capillary
Active phase HP-5
Column length (m) 50.
Carrier gas Helium
Substrate
Column diameter (mm) 0.32
Phase thickness (μm) 1.05
Program 40 0C (10 min) 5 0C/min -> 200 0C 15 0C/min -> 250 0C (10 min)
I 1509.
ReferenceVentanas, Estevez, et al., 2008
Comment MSDC-RI

References

Estevez, Ventanas, et al., 2005
Estevez, M.; Ventanas, S.; Ramirez, R.; Cava, R., Influence of the Addition of Rosemary Essential Oil on the Volatiles Pattern of Porcine Frankfurters, J. Agric. Food Chem., 2005, 53, 21, 8317-8324, https://doi.org/10.1021/jf051025q . [all data]