3-Pyridinol, 6-methyl-

Gas phase thermochemistry data

Data compiled by: Hussein Y. Afeefy, Joel F. Liebman, and Stephen E. Stein

Quantity Value Units Method Reference Comment
Δfgas-16.7 ± 0.62kcal/molCcbSuradi, El Saiad, et al., 1982

Condensed phase thermochemistry data

Data compiled by: Hussein Y. Afeefy, Joel F. Liebman, and Stephen E. Stein

Quantity Value Units Method Reference Comment
Δfsolid-39.67 ± 0.36kcal/molCcbSuradi, El Saiad, et al., 1982
Quantity Value Units Method Reference Comment
Δcsolid-763.74 ± 0.31kcal/molCcbSuradi, El Saiad, et al., 1982

Phase change data

Data compiled as indicated in comments:
ALS - Hussein Y. Afeefy, Joel F. Liebman, and Stephen E. Stein
AC - William E. Acree, Jr., James S. Chickos

Quantity Value Units Method Reference Comment
Δsub23.0 ± 0.50kcal/molCSuradi, El Saiad, et al., 1982ALS
Δsub23.0 ± 0.50kcal/molCSuradi, El Saiad, et al., 1982See also Pedley, Naylor, et al., 1986.; AC

Gas phase ion energetics data

Data compiled as indicated in comments:
LLK - Sharon G. Lias, Rhoda D. Levin, and Sherif A. Kafafi

Ionization energy determinations

IE (eV) Method Reference Comment
9.15 ± 0.05EIGronneberg and Undheim, 1972LLK

References

Suradi, El Saiad, et al., 1982
Suradi, S.; El Saiad, N.; Pilcher, G.; Skinner, H.A., Enthalpies of combustion of the three hydroxy-pyridines and the four hydroxy-2-methylpyridines, J. Chem. Thermodyn., 1982, 14, 45-50. [all data]

Pedley, Naylor, et al., 1986
Pedley, J.B.; Naylor, R.D.; Kirby, S.P., Thermochemical Data of Organic Compounds, 1986, https://doi.org/10.1007/978-94-009-4099-4 . [all data]