[3.3.3]Propellane-2,8-dione, 9-methylene-

Gas phase ion energetics data

Data compiled by: Sharon G. Lias and Joel F. Liebman

Ionization energy determinations

IE (eV) Method Reference Comment
8.5PEGleiter, Litterst, et al., 1988
8.77PEGleiter, Litterst, et al., 1988Vertical value

References

Gleiter, Litterst, et al., 1988
Gleiter, R.; Litterst, E.; Drouin, J., Interactions in 2,8,9-trifunctional [3.3.3]propellanes, Chem. Ber., 1988, 121, 923. [all data]