4H-Thiopyran-4-thione

Gas phase ion energetics data

Data compiled by: Sharon G. Lias, Rhoda D. Levin, and Sherif A. Kafafi

Ionization energy determinations

IE (eV) Method Reference Comment
7.96 ± 0.05PEColonna, Distefano, et al., 1980Vertical value

References

Colonna, Distefano, et al., 1980
Colonna, F.P.; Distefano, G.; Guerra, M.; Jones, D., Photoelectron (He(I), He(II) and X-ray) spectroscopy of γ-pyrone and its related sulphur derivatives: valence and core ionization energies shake-up satellites, J. Electron Spectrosc. Relat. Phenom., 1980, 18, 309. [all data]