[2H]benzene

Gas phase ion energetics data

Data compiled by: Henry M. Rosenstock, Keith Draxl, Bruce W. Steiner, and John T. Herron

Ionization energy determinations

IE (eV) Method Reference
9.44EIWacks and Dibeler, 1959

References

Wacks and Dibeler, 1959
Wacks, M.E.; Dibeler, V.H., Electron impact studies of aromatic hydrocarbons. I. Benzene, naphthalene, anthracene, and phenanthrene, J. Chem. Phys., 1959, 31, 1557. [all data]