2-Cyclopenten-1-one, 2-methyl-

Normal alkane RI, non-polar column, temperature ramp

Data compiled by: NIST Mass Spectrometry Data Center, William E. Wallace, director

Column type CapillaryCapillaryCapillaryCapillary
Active phase HP-5 MSZB-5HP-5MSDB-1
Column length (m) 30.30.30.60.
Carrier gas HeliumHeliumHeHe
Substrate
Column diameter (mm) 0.250.250.250.32
Phase thickness (μm) 0.250.250.251.
Tstart (C) 70.40.50.40.
Tend (C) 290.280.280.280.
Heat rate (K/min) 5.6.5.2.
Initial hold (min)  1.4.2.
Final hold (min) 10.9.10.40.
I 896.907.914.881.
ReferenceRadulovic, Blagojevic, et al., 2010Harrison and Priest, 2009Kim, Abd El-Aty, et al., 2006Lu, Yu, et al., 1997
Comment MSDC-RI MSDC-RI MSDC-RI MSDC-RI

Van Den Dool and Kratz RI, polar column, temperature ramp

Data compiled by: NIST Mass Spectrometry Data Center, William E. Wallace, director

Column type CapillaryCapillaryCapillaryCapillaryCapillary
Active phase CP-Wax 52CBSupelcowax-10Supelcowax-10CP-Wax 52CBCP-Wax 52CB
Column length (m) 50.60.60.50.50.
Carrier gas  HeHe
Substrate
Column diameter (mm) 0.320.250.250.320.32
Phase thickness (μm)  0.250.25
Tstart (C) 60.35.35.60.60.
Tend (C) 220.195.195.220.220.
Heat rate (K/min) 4.2.2.4.4.
Initial hold (min) 5.5.5.5.5.
Final hold (min) 30.90.90.30.30.
I 1355.1371.1371.1355.1353.
ReferenceMahadevan and Farmer, 2006Chung, Yung, et al., 2002Chung, Yung, et al., 2001Chevance and Farmer, 1999Chevance and Farmer, 1999, 2
Comment MSDC-RI MSDC-RI MSDC-RI MSDC-RI MSDC-RI
Column type CapillaryCapillaryCapillaryCapillary
Active phase CP-Wax 52CBDB-WaxCP-WAX 57CBCP-WAX 57CB
Column length (m) 50.60.50.50.
Carrier gas   He
Substrate
Column diameter (mm) 0.320.250.240.32
Phase thickness (μm)  0.25
Tstart (C) 40.50.50.60.
Tend (C) 220.230.210.200.
Heat rate (K/min) 4.2.2.4.
Initial hold (min) 5.4.5.5.
Final hold (min) 30.30.
I 1354.1367.1349.1367.
ReferenceChevance and Farmer, 1999, 2Shiratsuchi, Shimoda, et al., 1993Baltes and Mevissen, 1988Salter L.J., Mottram D.S., et al., 1988
Comment MSDC-RI MSDC-RI MSDC-RI MSDC-RI

Kovats' RI, polar column, temperature ramp

Data compiled by: NIST Mass Spectrometry Data Center, William E. Wallace, director

Column type Capillary
Active phase DB-Wax
Column length (m) 60.
Carrier gas He
Substrate
Column diameter (mm) 0.25
Phase thickness (μm)
Tstart (C) 40.
Tend (C) 190.
Heat rate (K/min) 3.
Initial hold (min) 6.
Final hold (min)
I 1357.
ReferenceShimoda and Shibamoto, 1990
Comment MSDC-RI

Lee's RI, non-polar column, custom temperature program

Data compiled by: NIST Mass Spectrometry Data Center, William E. Wallace, director

Column type Capillary
Active phase DB-5
Column length (m) 60.
Carrier gas
Substrate
Column diameter (mm)
Phase thickness (μm)
Program not specified
I 127.9
ReferenceFuentes, Font, et al., 2007
Comment MSDC-RI

References

Radulovic, Blagojevic, et al., 2010
Radulovic, N.; Blagojevic, P.; Palic, R., Comparative study of the leaf volatiles of Arctostaphylos uva-ursi (L.) Spreng. and Vaccinium vitis-idaea L. (Ericaceae), Molecules, 2010, 15, 9, 6168-6185, https://doi.org/10.3390/molecules15096168 . [all data]

Harrison and Priest, 2009
Harrison, B.M.; Priest, F.G., Composition of peaks used in the preparation of malt for Scotch Whisky production - influence of geographical source and extraction depth, J. Agric. Food Chem., 2009, 57, 6, 2385-2391, https://doi.org/10.1021/jf803556y . [all data]

Kim, Abd El-Aty, et al., 2006
Kim, M.R.; Abd El-Aty, A.M.; Kim, I.S.; Shim, J.H., Determination of volatile flavor components in danggui cultivars by solvent free injection and hydrodistillation followed by gas chromatographic-mass spectrometric analysis, J. Chromatogr. A, 2006, 1116, 1-2, 259-264, https://doi.org/10.1016/j.chroma.2006.03.060 . [all data]

Lu, Yu, et al., 1997
Lu, G.; Yu, T.-H.; Ho, C.-T., Generation of flavor compounds by the reaction of 2-deoxyglucose with selected amino acids, J. Agric. Food Chem., 1997, 45, 1, 233-236, https://doi.org/10.1021/jf960609c . [all data]