13-Docosenoic acid, methyl ester, (Z)-

Kovats' RI, non-polar column, isothermal

View large format table.

Column type Active phase Temperature (C) I Reference Comment
CapillaryOV-101200.2460.3Kittiratanapiboon, Jeyashoke, et al., 199815. m/0.25 mm/0.2 μm, N2
CapillaryCP Sil 5 CB240.2473.Hanai and Hong, 198930. m/0.25 mm/0.25 μm
PackedSE-30200.2480.Golovnya, Uralets, et al., 1976Gas Chrom Q (80-100 mesh); Column length: 1.5 m

Kovats' RI, polar column, isothermal

View large format table.

Column type Active phase Temperature (C) I Reference Comment
CapillaryCP-Wax240.2844.Hanai and Hong, 198925. m/0.25 mm/0.22 μm
CapillaryDB-Wax240.2878.Hanai and Hong, 198925. m/0.25 mm/0.22 μm

Van Den Dool and Kratz RI, non-polar column, custom temperature program

View large format table.

Column type Active phase I Reference Comment
CapillaryVF-5MS2507.8Tret'yakov, 200730. m/0.25 mm/0.25 μm, He; Program: Multi-step temperature program; T(initial)=60C; T(final)=270C

Normal alkane RI, non-polar column, isothermal

View large format table.

Column type Active phase Temperature (C) I Reference Comment
CapillaryLM-1210.2486.Filho and Lancas, 199530. m/0.25 mm/0.25 μm, Hydrogen

Normal alkane RI, non-polar column, temperature ramp

View large format table.

Column type Active phase I Reference Comment
CapillaryDB-12459.Krop, 200330. m/0.32 mm/0.25 μm, Helium, 10. K/min; Tstart: 160. C; Tend: 252. C

Phase change data

Data compiled by: William E. Acree, Jr., James S. Chickos

Quantity Value Units Method Reference Comment
Δvap30.02 ± 0.29kcal/molCGCLipkind, Kapustin, et al., 2007
Δvap29.59kcal/molGCKrop, Velzen, et al., 1997Based on data from 463. - 523. K.

Enthalpy of vaporization

ΔvapH (kcal/mol) Temperature (K) Method Reference Comment
22.3498.GCHusain, Sarma, et al., 1993Based on data from 453. - 543. K.

References

Kittiratanapiboon, Jeyashoke, et al., 1998
Kittiratanapiboon, K.; Jeyashoke, N.; Krisnangkura, K., The relationship of Kováts retention indices and equivalent chain lengths of fatty acid methyl esters on a methyl silicone capillary column, J. Chromatogr. Sci., 1998, 36, 7, 361-364, https://doi.org/10.1093/chromsci/36.7.361 . [all data]

Hanai and Hong, 1989
Hanai, T.; Hong, C., Structure-retention correlation in CGC, J. Hi. Res. Chromatogr., 1989, 12, 5, 327-332, https://doi.org/10.1002/jhrc.1240120517 . [all data]

Golovnya, Uralets, et al., 1976
Golovnya, R.V.; Uralets, V.P.; Kuzmenko, T.E., Characterization of fatty acid methyl esters by gas chromatography on siloxane liquid phases, J. Chromatogr., 1976, 121, 1, 118-121, https://doi.org/10.1016/S0021-9673(00)82312-2 . [all data]

Tret'yakov, 2007
Tret'yakov, K.V., Retention Data. NIST Mass Spectrometry Data Center., NIST Mass Spectrometry Data Center, 2007. [all data]

Filho and Lancas, 1995
Filho, N.R.A.; Lancas, F.M., Identification of FAMEs using ECL values and a three-dimensional Kovats retention index system, J. High Resol. Chromatogr., 1995, 18, 3, 167-170, https://doi.org/10.1002/jhrc.1240180306 . [all data]

Krop, 2003
Krop, H.B., Thermodynamic approaches for the environmental chemistry of organic pollutants (Dissertation), 2003. [all data]