Eicosanoic acid, methyl ester

Lee's RI, non-polar column, temperature ramp

Data compiled by: NIST Mass Spectrometry Data Center, William E. Wallace, director

Column type CapillaryCapillaryCapillaryCapillaryCapillary
Active phase DB-5MSDB-5MSDB-1DB-1DB-5
Column length (m) 30.30.30.30.30.
Carrier gas     N2
Substrate
Column diameter (mm) 0.250.250.20.20.25
Phase thickness (μm) 0.50.50.250.250.215
Tstart (C) 40.40.50.50.50.
Tend (C) 310.310.300.300.300.
Heat rate (K/min) 10.4.5.5.6.
Initial hold (min) 1.1.2.2.4.
Final hold (min)   5.5.20.
I 376.90380.64390.6390.6379.61
ReferenceChen, Keeran, et al., 2002Chen, Keeran, et al., 2002Johnson, Urso, et al., 1997Johnson, Urso, et al., 1997Wang, Jin, et al., 1992
Comment MSDC-RI MSDC-RI MSDC-RI MSDC-RI MSDC-RI
Column type Capillary
Active phase DB-5
Column length (m) 30.
Carrier gas He
Substrate
Column diameter (mm) 0.26
Phase thickness (μm) 0.25
Tstart (C) 50.
Tend (C) 300.
Heat rate (K/min) 6.
Initial hold (min) 4.
Final hold (min) 20.
I 378.87
ReferenceRostad and Pereira, 1986
Comment MSDC-RI

Van Den Dool and Kratz RI, non-polar column, custom temperature program

Data compiled by: NIST Mass Spectrometry Data Center, William E. Wallace, director

Column type CapillaryCapillary
Active phase HP-5DB-1
Column length (m) 30.15.
Carrier gas HeHe
Substrate
Column diameter (mm) 0.250.53
Phase thickness (μm) 0.251.
Program 50C => 6C/min => 100C => 4C/min => 280C40C(3min) => 8C/min => 200(1min) => 5C/min => 300C(25min)
I 2332.2311.
ReferenceIsidorov, Krajewska, et al., 2001Peng, 2000
Comment MSDC-RI MSDC-RI

Kovats' RI, non-polar column, isothermal

View large format table.

Column type Active phase Temperature (C) I Reference Comment
CapillaryOV-101170.2295.6Kittiratanapiboon, Jeyashoke, et al., 199815. m/0.25 mm/0.2 μm, N2
CapillaryOV-101175.2296.7Kittiratanapiboon, Jeyashoke, et al., 199815. m/0.25 mm/0.2 μm, N2
CapillaryOV-101180.2297.8Kittiratanapiboon, Jeyashoke, et al., 199815. m/0.25 mm/0.2 μm, N2
CapillaryOV-101185.2299.Kittiratanapiboon, Jeyashoke, et al., 199815. m/0.25 mm/0.2 μm, N2
CapillaryOV-101190.2300.2Kittiratanapiboon, Jeyashoke, et al., 199815. m/0.25 mm/0.2 μm, N2
CapillaryOV-101195.2301.4Kittiratanapiboon, Jeyashoke, et al., 199815. m/0.25 mm/0.2 μm, N2
CapillaryOV-101200.2302.7Kittiratanapiboon, Jeyashoke, et al., 199815. m/0.25 mm/0.2 μm, N2
CapillaryCP Sil 5 CB240.2312.Hanai and Hong, 198930. m/0.25 mm/0.25 μm
PackedSE-30200.2314.Golovnya and Kuzmenko, 1977He, Chromosorb W (80-100 mesh); Column length: 1.5 m
PackedSE-30200.2314.Golovnya, Uralets, et al., 1976Gas Chrom Q (80-100 mesh); Column length: 1.5 m

Kovats' RI, non-polar column, temperature ramp

View large format table.

Column type Active phase I Reference Comment
CapillaryBP-12318.Srivastava, Srivastava, et al., 200630. m/0.32 mm/0.25 μm, N2, 5. K/min, 220. C @ 3. min; Tstart: 60. C

Kovats' RI, polar column, isothermal

View large format table.

Column type Active phase Temperature (C) I Reference Comment
CapillaryCP-Wax240.2617.Hanai and Hong, 198925. m/0.25 mm/0.22 μm
CapillaryDB-Wax240.2646.Hanai and Hong, 198925. m/0.25 mm/0.22 μm

Van Den Dool and Kratz RI, non-polar column, temperature ramp

View large format table.

Column type Active phase I Reference Comment
CapillaryHP-52339.Fokialakis, Melliou, et al., 200330. m/0.25 mm/0.25 μm, He, 3. K/min; Tstart: 60. C; Tend: 280. C
CapillaryDB-12310.Johnson, Urso, et al., 199730. m/0.2 mm/0.25 μm, 50. C @ 2. min, 5. K/min, 300. C @ 5. min
CapillaryDB-12310.Johnson, Urso, et al., 199730. m/0.2 mm/0.25 μm, 50. C @ 2. min, 5. K/min, 300. C @ 5. min
CapillaryUltra-12311.59Richmond and Pombo-Villar, 199725. m/0.32 mm/0.52 μm, 15. K/min, 320. C @ 10. min; Tstart: 35. C
CapillaryOV-12302.Tan, Holland, et al., 1988He, 8. K/min, 280. C @ 10. min; Column length: 25. m; Column diameter: 0.32 mm; Tstart: 40. C
CapillaryDB-52329.Rostad and Pereira, 198630. m/0.26 mm/0.25 μm, He, 50. C @ 4. min, 6. K/min, 300. C @ 20. min

Van Den Dool and Kratz RI, polar column, temperature ramp

View large format table.

Column type Active phase I Reference Comment
CapillaryDB-Wax2638.Peng, 200015. m/0.53 mm/1. μm, He, 40. C @ 3. min, 5. K/min, 220. C @ 30. min
CapillaryHP-Wax2640.Peng, 200015. m/0.53 mm/1. μm, He, 40. C @ 3. min, 5. K/min, 220. C @ 30. min

Normal alkane RI, non-polar column, isothermal

View large format table.

Column type Active phase Temperature (C) I Reference Comment
CapillaryDB-1200.2311.Aryusuk and Krisnangkura, 2003
CapillaryLM-1210.2317.Filho and Lancas, 199530. m/0.25 mm/0.25 μm, Hydrogen

Normal alkane RI, non-polar column, temperature ramp

View large format table.

Column type Active phase I Reference Comment
CapillaryRTx-12311.Dib, Bendahou, et al., 201060. m/0.22 mm/0.25 μm, Helium, 2. K/min, 230. C @ 35. min; Tstart: 60. C
CapillaryHP-5 MS2335.Vedernikov and Roschin, 201030. m/0.25 mm/0.25 μm, Helium, 5. K/min, 280. C @ 10. min; Tstart: 150. C
CapillaryDB-12305.Guy and Vernin, 1996He, 70. C @ 5. min, 3. K/min; Column length: 30. m; Column diameter: 0.25 mm; Tend: 300. C
CapillaryDB-52333.Wang, Jin, et al., 199230. m/0.25 mm/0.215 μm, N2, 50. C @ 4. min, 6. K/min, 300. C @ 20. min
CapillaryUltra-12309.Okumura, 199125. m/0.32 mm/0.25 μm, He, 3. K/min; Tstart: 80. C; Tend: 260. C
PackedSE-302313.Horning, Casparrini, et al., 1969Gas Chrom P, 2. K/min; Column length: 3.7 m; Tstart: 145. C

Normal alkane RI, non-polar column, custom temperature program

View large format table.

Column type Active phase I Reference Comment
CapillarySiloxane, 5 % Ph2307.VOC BinBase, 2012Program: not specified
CapillaryPolydimethyl siloxane, 5 % phenyl2307.Skogerson, Wohlgemuth, et al., 2011Program: not specified
CapillaryRTx-12312.Dib, Bendahou, et al., 201060. m/0.22 mm/0.25 μm, Helium; Program: not specified
CapillaryHP-5 MS2324.Vedernikov and Roschin, 201030. m/0.25 mm/0.25 μm, Helium; Program: not specified
CapillaryDB-52329.Wang, Jin, et al., 199230. m/0.25 mm/0.215 μm, N2; Program: not specified

Lee's RI, non-polar column, custom temperature program

View large format table.

Column type Active phase I Reference Comment
CapillaryPolydimethyl siloxanes378.87Eckel and Kind, 2003Program: not specified
CapillaryDB-5378.87Wang, Jin, et al., 199230. m/0.25 mm/0.215 μm, N2; Program: not specified

Condensed phase thermochemistry data

Data compiled by: Hussein Y. Afeefy, Joel F. Liebman, and Stephen E. Stein

Quantity Value Units Method Reference Comment
Δcsolid-3170.0 ± 0.1kcal/molCcbFreedman, Bagby, et al., 1989Corresponding Δfsolid = -239.7 kcal/mol (simple calculation by NIST; no Washburn corrections)

Phase change data

Data compiled as indicated in comments:
BS - Robert L. Brown and Stephen E. Stein
AC - William E. Acree, Jr., James S. Chickos

Quantity Value Units Method Reference Comment
Δvap28.90 ± 0.60kcal/molCGCChickos, Zhao, et al., 2004Based on data from 467. - 558. K.; AC
Δvap27.82 ± 0.36kcal/molN/Avan Genderen, van Miltenburg, et al., 2002AC
Δvap27.77kcal/molGCKrop, Velzen, et al., 1997Based on data from 463. - 523. K.; AC

Reduced pressure boiling point

Tboil (K) Pressure (atm) Reference Comment
488.70.013Weast and Grasselli, 1989BS
461.20.003Weast and Grasselli, 1989BS

Enthalpy of vaporization

ΔvapH (kcal/mol) Temperature (K) Method Reference Comment
26.10350.N/Avan Genderen, van Miltenburg, et al., 2002AC
23.4 ± 0.05406.N/Avan Genderen, van Miltenburg, et al., 2002AC
18.4498.GCHusain, Sarma, et al., 1993Based on data from 453. - 543. K.; AC
22.1465.A,ESTStephenson and Malanowski, 1987Based on data from 450. - 540. K. See also Rose and Schrodt, 1963.; AC

Enthalpy of sublimation

ΔsubH (kcal/mol) Temperature (K) Method Reference Comment
45.6 ± 2.4314.MEDavies and Kybett, 1965Based on data from 311. - 318. K. See also Stephenson and Malanowski, 1987.; AC

Enthalpy of fusion

ΔfusH (kcal/mol) Temperature (K) Method Reference Comment
17.8319.2DSCChickos, Zhao, et al., 2004AC
17.6319.2N/AKing and Garner, 1936AC

References

Chen, Keeran, et al., 2002
Chen, P.H.; Keeran, W.S.; Van Ausdale, W.A.; Schindler, D.R.; Roberts, D.W., Application of Lee retention indices to the confirmation of tentatively identified compounds from GC/MS analysis of environmental samples, Technical paper, Analytical Services Division, Environmental ScienceEngineering, Inc, PO Box 1703, Gainesville, FL 32602, 2002, 11. [all data]

Johnson, Urso, et al., 1997
Johnson, C.I.; Urso, A.; Geleta, L., Broad spectrum analysis of municipal and industrial effluents discharged into the Peace, Athabasca and Slave river basins: characterization of effluent samples, 1994 - Volume 1 of 2, Northern River Basins Study Project Report No. 121, Norther River Basins Study, Edmonton, Alberta, 1997, 27. [all data]

Wang, Jin, et al., 1992
Wang, X.; Jin, Z.; Xu, X., Analysis of fatty acids in bacteria by using gas chromatographic retention indices, Chin. J. Chromatogr., 1992, 10, 2, 92-94. [all data]

Rostad and Pereira, 1986
Rostad, C.E.; Pereira, W.E., Kovats and Lee retention indices determined by gas chromatography/mass spectrometry for organic compounds of environmental interest, J. Hi. Res. Chromatogr. Chromatogr. Comm., 1986, 9, 6, 328-334, https://doi.org/10.1002/jhrc.1240090603 . [all data]