C6O

Vibrational and/or electronic energy levels

Data compiled by: Marilyn E. Jacox

State:   X

Vib.
sym.
 No.   Approximate
 type of mode
 cm-1   Med.   Method   References

Σ+ 2163.8 Ar IR Maier, Reisenauer, et al., 1991
1447.8 Ar IR Maier, Reisenauer, et al., 1991

Additional references: Jacox, 1994, page 370; Jacox, 1998, page 330; Ohshima, Endo, et al., 1995

References

Maier, Reisenauer, et al., 1991
Maier, G.; Reisenauer, H.P.; Ulrich, A., Matrixspektroskopische untersuchungen zur existenz von C7 O2 (1,2,3,4,5,6-heptahexaen-1,7-dion), Tetrahed. Lett., 1991, 32, 35, 4469, https://doi.org/10.1016/0040-4039(91)80014-W . [all data]

Jacox, 1994
Jacox, M.E., Vibrational and electronic energy levels of polyatomic transient molecules, American Chemical Society, Washington, DC, 1994, 464. [all data]

Jacox, 1998
Jacox, M.E., Vibrational and electronic energy levels of polyatomic transient molecules: supplement A, J. Phys. Chem. Ref. Data, 1998, 27, 2, 115-393, https://doi.org/10.1063/1.556017 . [all data]

Ohshima, Endo, et al., 1995
Ohshima, Y.; Endo, Y.; Ogata, T., Fourier-transform microwave spectroscopy of triplet carbon monoxides, C2O, C4O, C6O, and C8O, J. Chem. Phys., 1995, 102, 4, 1493, https://doi.org/10.1063/1.468881 . [all data]