C4O radical

Gas phase ion energetics data

Data compiled by: John E. Bartmess

Electron affinity determinations

EA (eV) Method Reference Comment
2.05 ± 0.15LPESOakes and Ellison, 1986Calculations ( Rienstra-Kiracofe, Ellison, et al., 2000) imply EA = 3 eV, above laser wavelength

References

Oakes and Ellison, 1986
Oakes, J.M.; Ellison, G.B., Photoelectron spectroscopy of radical anions, Tetrahedron, 1986, 42, 6263. [all data]

Rienstra-Kiracofe, Ellison, et al., 2000
Rienstra-Kiracofe, J.C.; Ellison, G.B.; Hoffman, B.C.; Schaefer III, H.F., The Electron Affinities of C3O and C4O, J. Phys. Chem. A, 2000, 104, 11, 2273, https://doi.org/10.1021/jp9918104 . [all data]