Zinc, dibutyl-

Phase change data

Data compiled by: William E. Acree, Jr., James S. Chickos

Enthalpy of vaporization

ΔvapH (kJ/mol) Temperature (K) Reference Comment
50.7 ± 0.3342.Sokolovskii and Baev, 1984Based on data from 305. - 379. K.

References

Sokolovskii and Baev, 1984
Sokolovskii, A.E.; Baev, A.K., Russ. J. Phys. Chem., 1984, 58, 1635. [all data]