Ethanol, 2-(2-ethoxyethoxy)-
- Formula: C6H14O3
- Molecular weight: 134.1736
- IUPAC Standard InChIKey: XXJWXESWEXIICW-UHFFFAOYSA-N
- CAS Registry Number: 111-90-0
- Chemical structure:

Phase change data

Data compiled as indicated in comments:
BS - Robert L. Brown and Stephen E. Stein
TRC - Thermodynamics Research Center, NIST Boulder Laboratories, Chris Muzny director
AC - William E. Acree, Jr., James S. Chickos
Quantity | Value | Units | Method | Reference | Comment |
---|---|---|---|---|---|
Tboil | 475.2 | K | N/A | Aldrich Chemical Company Inc., 1990 | BS |
Tboil | 468. | K | N/A | Whitmore and Lieber, 1935 | Uncertainty assigned by TRC = 2. K; TRC |
Quantity | Value | Units | Method | Reference | Comment |
Tc | 670. | K | N/A | Wilson, Wilson, et al., 1996 | Uncertainty assigned by TRC = 4. K; TRC |
Quantity | Value | Units | Method | Reference | Comment |
Pc | 31.67 | bar | N/A | Wilson, Wilson, et al., 1996 | Uncertainty assigned by TRC = 0.26 bar; TRC |
Enthalpy of vaporization
ΔvapH (kJ/mol) | Temperature (K) | Method | Reference | Comment |
---|---|---|---|---|
52.1 | 333. | A | Stephenson and Malanowski, 1987 | Based on data from 318. to 475. K. See also Stull, 1947.; AC |
Antoine Equation Parameters
log10(P) = A − (B / (T + C))
P = vapor pressure (bar)
T = temperature (K)
View plot Requires a JavaScript / HTML 5 canvas capable browser.
Temperature (K) | A | B | C | Reference | Comment |
---|---|---|---|---|---|
318.4 to 475.1 | 5.75422 | 2708.472 | -4.207 | Stull, 1947 | Coefficents calculated by NIST from author's data. |
313.6 to 424. | 4.35405 | 1667.952 | -91.268 | Gardner and Brewer, 1937 | Coefficents calculated by NIST from author's data. |

Normal alkane RI, non-polar column, custom temperature program

Data compiled by: NIST Mass Spectrometry Data Center, William E. Wallace, director

Column type CapillaryCapillary
Active phase SE-30DB-1
Column length (m)  60.
Carrier gas
Substrate
Column diameter (mm)  0.32
Phase thickness (μm)  0.25
Program not specifiednot specified
I 986.979.
ReferenceVinogradov, 2004Ciccioli, Cecinato, et al., 1994
Comment MSDC-RI MSDC-RI

Kovats' RI, non-polar column, isothermal

Data compiled by: NIST Mass Spectrometry Data Center, William E. Wallace, director

Column type CapillaryPacked
Active phase SE-30Apiezon L
Column length (m) 40.
Carrier gas
Substrate
Column diameter (mm) 0.35
Phase thickness (μm) 0.35
Temperature (C) 100.170.
I 982.9951.
ReferenceTudor, 1997Singliar and Dykyj, 1969
Comment MSDC-RI MSDC-RI

Normal alkane RI, polar column, custom temperature program

Data compiled by: NIST Mass Spectrometry Data Center, William E. Wallace, director

Column type CapillaryCapillaryCapillaryCapillary
Active phase DB-WaxSupelko CO WaxCarbowax 20MHP Innowax FSP
Column length (m) 30.60. 60.
Carrier gas HeliumHelium He
Substrate
Column diameter (mm) 0.250.32 0.25
Phase thickness (μm) 0.250.25 0.25
Program not specified40 0C (5 min) 4 0C/min -> 75 0C 5 0C/min -> 250 0C (10 min)not specified60C(10min) => 4C/min => 220C (10min) => 1C/min => 240C
I 1622.1636.1583.1628.
ReferenceWelke, Manfroi, et al., 2012Vekiari, Orepoulou, et al., 2010Vinogradov, 2004Tasdemir, Demirci, et al., 2003
Comment MSDC-RI MSDC-RI MSDC-RI MSDC-RI

Van Den Dool and Kratz RI, polar column, temperature ramp

Data compiled by: NIST Mass Spectrometry Data Center, William E. Wallace, director

Column type CapillaryCapillary
Active phase DB-WaxDB-Wax
Column length (m) 60.30.
Carrier gas  He
Substrate
Column diameter (mm) 0.250.25
Phase thickness (μm) 0.25
Tstart (C) 50.40.
Tend (C) 230.200.
Heat rate (K/min) 2.2.
Initial hold (min)  5.
Final hold (min)
I 1619.1615.
ReferenceShimoda, Shigematsu, et al., 1995Iwaoka, Hagi, et al., 1994
Comment MSDC-RI MSDC-RI

References

Aldrich Chemical Company Inc., 1990
Aldrich Chemical Company Inc.,
Catalog Handbook of Fine Chemicals, Aldrich Chemical Company, Inc., Milwaukee WI, 1990, 1. [all data]
Whitmore and Lieber, 1935
Whitmore, W.F.; Lieber, E.,
Identification of Certain SOlvens by the Xanthate Reaction,
Ind. Eng. Chem., Anal. Ed., 1935, 7, 127-9. [all data]
Wilson, Wilson, et al., 1996
Wilson, L.C.; Wilson, H.L.; Wilding, W.V.; Wilson, G.M.,
Critical Point Measurements for Fourteen Compounds by a Static Method and a Flow Method,
J. Chem. Eng. Data, 1996, 41, 1252-4. [all data]
Stephenson and Malanowski, 1987
Stephenson, Richard M.; Malanowski, Stanislaw,
Handbook of the Thermodynamics of Organic Compounds, 1987, https://doi.org/10.1007/978-94-009-3173-2
. [all data]
Stull, 1947
Stull, Daniel R.,
Vapor Pressure of Pure Substances. Organic and Inorganic Compounds,
Ind. Eng. Chem., 1947, 39, 4, 517-540, https://doi.org/10.1021/ie50448a022
. [all data]
Gardner and Brewer, 1937
Gardner, George S.; Brewer, J. Edward,
Vapor Pressure of Commerical High-Boiling Organic Solvents,
Ind. Eng. Chem., 1937, 29, 2, 179-181, https://doi.org/10.1021/ie50326a014
. [all data]