Dodecanoic acid, methyl ester

Condensed phase thermochemistry data

Data compiled by: Hussein Y. Afeefy, Joel F. Liebman, and Stephen E. Stein

Quantity Value Units Method Reference Comment
Δcliquid-8117.0 ± 0.4kJ/molCcbFreedman, Bagby, et al., 1989Corresponding Δfliquid = -714.6 kJ/mol (simple calculation by NIST; no Washburn corrections)
Δcliquid-8137.8 ± 1.6kJ/molCcbAdriaanse, Dekker, et al., 1965Corresponding Δfliquid = -693.6 kJ/mol (simple calculation by NIST; no Washburn corrections)

Phase change data

Data compiled as indicated in comments:
BS - Robert L. Brown and Stephen E. Stein
TRC - Thermodynamics Research Center, NIST Boulder Laboratories, Chris Muzny director
AC - William E. Acree, Jr., James S. Chickos
ALS - Hussein Y. Afeefy, Joel F. Liebman, and Stephen E. Stein

Quantity Value Units Method Reference Comment
Tfus278.45KN/AGaikwad and Subrahmanyam, 1985Uncertainty assigned by TRC = 0.35 K; TRC
Tfus278.KN/AAdriaanse, Dekker, et al., 1964Uncertainty assigned by TRC = 0.05 K; TRC
Quantity Value Units Method Reference Comment
Tc712.15KN/AAmbrose, 1963Uncertainty assigned by TRC = 3. K; TRC
Quantity Value Units Method Reference Comment
Δvap76.9 ± 0.6kJ/molAVGN/AAverage of 6 values; Individual data points

Reduced pressure boiling point

Tboil (K) Pressure (bar) Reference Comment
535.21.02Weast and Grasselli, 1989BS
414.20.020Weast and Grasselli, 1989BS

Enthalpy of vaporization

ΔvapH (kJ/mol) Temperature (K) Method Reference Comment
71.4350.N/Avan Genderen, van Miltenburg, et al., 2002AC
70.7 ± 0.2356.N/Avan Genderen, van Miltenburg, et al., 2002AC
74.9310.N/ABureau, Jose, et al., 2001Based on data from 295. - 452. K.; AC
53.3498.GCHusain, Sarma, et al., 1993Based on data from 453. - 543. K.; AC
83.6302.AStephenson and Malanowski, 1987Based on data from 287. - 333. K.; AC
63.6422.AStephenson and Malanowski, 1987Based on data from 407. - 540. K. See also Rose and Schrodt, 1963.; AC
80.8293.VSpizzichino, 1956ALS
69.33293.VScott, Macmillan, et al., 1952ALS
71.4351.MG,OMScott, Macmillan, et al., 1952Based on data from 336. - 409. K.; AC
62.3388.N/AAlthouse and Triebold, 1944Based on data from 373. - 439. K.; AC

Antoine Equation Parameters

log10(P) = A − (B / (T + C))
    P = vapor pressure (bar)
    T = temperature (K)

View plot Requires a JavaScript / HTML 5 canvas capable browser.

Temperature (K) A B C Reference Comment
373. - 439.4.817072303.546-61.592Althouse and Triebold, 1944Coefficents calculated by NIST from author's data.

Enthalpy of sublimation

ΔsubH (kJ/mol) Temperature (K) Method Reference Comment
121.8 ± 2.1267.MEDavies and Kybett, 1965Based on data from 262. - 273. K. See also Stephenson and Malanowski, 1987.; AC

In addition to the Thermodynamics Research Center (TRC) data available from this site, much more physical and chemical property data is available from the following TRC products:

Kovats' RI, non-polar column, isothermal

View large format table.

Column type Active phase Temperature (C) I Reference Comment
CapillaryOV-101200.1514.9Kittiratanapiboon, Jeyashoke, et al., 199815. m/0.25 mm/0.2 μm, N2
CapillaryCP Sil 5 CB240.1510.Hanai and Hong, 198930. m/0.25 mm/0.25 μm
CapillaryDB-1240.1518.Hanai and Hong, 198930. m/0.25 mm/0.25 μm
CapillarySE-30140.1508.Haken and Korhonen, 1984N2; Column length: 25. m; Column diameter: 0.22 mm
PackedSE-30200.1513.Golovnya and Kuzmenko, 1977He, Chromosorb W (80-100 mesh); Column length: 1.5 m
PackedSE-30200.1513.Golovnya, Uralets, et al., 1976Gas Chrom Q (80-100 mesh); Column length: 1.5 m

Kovats' RI, non-polar column, custom temperature program

View large format table.

Column type Active phase I Reference Comment
CapillaryHP-5MS1527.Alissandrakis E., Tarantilis P.A., et al., 200730. m/0.25 mm/0.25 μm, He; Program: 40C(3min) => 3C/min => 160C => 10C/min => 200C

Kovats' RI, polar column, isothermal

View large format table.

Column type Active phase Temperature (C) I Reference Comment
CapillaryCP-Wax240.1802.Hanai and Hong, 198925. m/0.25 mm/0.22 μm
CapillaryDB-Wax240.1834.Hanai and Hong, 198925. m/0.25 mm/0.22 μm
CapillaryCarbowax 20M140.1770.Haken and Korhonen, 1984N2; Column length: 22. m; Column diameter: 0.3 mm
CapillaryCarbowax 20M110.1798.Krupcik, Matisova, et al., 1982N2; Column length: 25. m; Column diameter: 0.25 mm
CapillaryCarbowax 20M110.1805.9Krupcik, Matisova, et al., 1982N2; Column length: 25. m; Column diameter: 0.25 mm
CapillaryCarbowax 20M110.1807.1Krupcik, Matisova, et al., 1982N2; Column length: 25. m; Column diameter: 0.25 mm
CapillaryCarbowax 20M110.1813.Krupcik, Matisova, et al., 1982N2; Column length: 25. m; Column diameter: 0.25 mm
CapillaryCarbowax 20M90.1784.9Krupcik, Matisova, et al., 1982N2; Column length: 25. m; Column diameter: 0.25 mm
CapillaryCarbowax 20M90.1801.5Krupcik, Matisova, et al., 1982N2; Column length: 25. m; Column diameter: 0.25 mm
CapillaryCarbowax 20M90.1806.7Krupcik, Matisova, et al., 1982N2; Column length: 25. m; Column diameter: 0.25 mm
CapillaryCarbowax 20M90.1819.7Krupcik, Matisova, et al., 1982N2; Column length: 25. m; Column diameter: 0.25 mm

Kovats' RI, polar column, temperature ramp

View large format table.

Column type Active phase I Reference Comment
CapillaryBP-201785.MacLeod and Pieris, 1983H2, 65. C @ 3. min, 12. K/min; Column length: 25. m; Column diameter: 0.20 mm; Tend: 180. C

Van Den Dool and Kratz RI, non-polar column, temperature ramp

View large format table.

Column type Active phase I Reference Comment
CapillarySPB-51525.Engel and Ratel, 200760. m/0.32 mm/1. μm, 40. C @ 2. min, 3. K/min, 230. C @ 10. min
CapillaryHP-51526.Quijano, Salamanca, et al., 200730. m/0.25 mm/0.25 μm, He, 50. C @ 4. min, 4. K/min, 250. C @ 10. min
CapillaryHP-51527.Flamini, Tebano, et al., 200630. m/0.25 mm/0.25 μm, N2, 60. C @ 10. min, 5. K/min; Tend: 220. C
CapillaryHP-5MS1526.Pino, Mesa, et al., 200530. m/0.25 mm/0.25 μm, He, 60. C @ 2. min, 4. K/min, 250. C @ 20. min
CapillaryCP Sil 5 CB1509.Pino, Almora, et al., 200360. m/0.32 mm/0.25 μm, He, 60. C @ 10. min, 3. K/min, 280. C @ 60. min
CapillaryDB-11507.0Sun and Stremple, 200330. m/0.25 mm/0.25 μm, He, 3. K/min; Tstart: 40. C; Tend: 325. C
CapillaryHP-51527.Lazari, Skaltsa, et al., 200030. m/0.25 mm/0.25 μm, He, 50. C @ 5. min, 4. K/min; Tend: 280. C
CapillaryOV-11509.Valero, Sanz, et al., 199920. m/0.32 mm/0.3 μm, He, 45. C @ 5. min, 10. K/min, 220. C @ 10. min
CapillaryOV-11505.Valero, Sanz, et al., 199920. m/0.32 mm/0.3 μm, He, 45. C @ 5. min, 10. K/min, 220. C @ 10. min
CapillaryDB-11506.Johnson, Urso, et al., 199730. m/0.2 mm/0.25 μm, 50. C @ 2. min, 5. K/min, 300. C @ 5. min
CapillaryDB-11506.Johnson, Urso, et al., 199730. m/0.2 mm/0.25 μm, 50. C @ 2. min, 5. K/min, 300. C @ 5. min
CapillaryDB-11506.Johnson, Urso, et al., 199730. m/0.2 mm/0.25 μm, 50. C @ 2. min, 5. K/min, 300. C @ 5. min
CapillarySE-301509.de Frutos, Sanz, et al., 199122. m/0.30 mm/1.0 μm, N2, 2. K/min; Tstart: 60. C; Tend: 250. C
CapillaryBP-11507.Tan, Wilkins, et al., 1989H2, 40. C @ 2. min, 4. K/min, 240. C @ 75. min; Column length: 12. m
CapillaryDB-51524.Rostad and Pereira, 198630. m/0.26 mm/0.25 μm, He, 50. C @ 4. min, 6. K/min, 300. C @ 20. min
CapillarySE-541526.Weber, 198625. m/0.31 mm/0.17 μm, H2, 2. K/min; Tstart: 35. C
CapillarySE-541527.Weber, 198625. m/0.31 mm/0.17 μm, H2, 2. K/min; Tstart: 35. C
PackedSE-301513.van den Dool and Kratz, 1963Celite; Tstart: 75. C; Tend: 228. C

Van Den Dool and Kratz RI, non-polar column, custom temperature program

View large format table.

Column type Active phase I Reference Comment
CapillaryVF-5MS1521.3Tret'yakov, 200730. m/0.25 mm/0.25 μm, He; Program: Multi-step temperature program; T(initial)=60C; T(final)=270C
CapillaryVF-5MS1521.7Tret'yakov, 200730. m/0.25 mm/0.25 μm, He; Program: Multi-step temperature program; T(initial)=60C; T(final)=270C
CapillaryDB-51526.Wang, Finn, et al., 200530. m/0.32 mm/1. μm, He; Program: 40C(2min) => 5C/min => 100C => 4C/min => 230C (10min)
CapillaryHP-51527.Isidorov, Krajewska, et al., 200130. m/0.25 mm/0.25 μm, He; Program: 50C => 6C/min => 100C => 4C/min => 280C
CapillaryDB-11514.Eri, Khoo, et al., 200060. m/0.25 mm/0.25 μm, He; Program: -20C (5min) => 10C/min => 100C => 4C/min => 200C => 10C/min => 280C
CapillaryDB-11506.Peng, 200015. m/0.53 mm/1. μm, He; Program: 40C(3min) => 8C/min => 200(1min) => 5C/min => 300C(25min)
PackedSE-301503.Peng, Ding, et al., 1988Supelcoport; Chromosorb; Column length: 3.05 m; Program: 40C(5min) => 10C/min => 200C or 250C (60min)

Van Den Dool and Kratz RI, polar column, temperature ramp

View large format table.

Column type Active phase I Reference Comment
CapillaryHP-Wax1801.Flamini, Tebano, et al., 200630. m/0.25 mm/0.25 μm, N2, 60. C @ 10. min, 5. K/min; Tend: 220. C
CapillaryZB-Wax1800.Ledauphin, Saint-Clair, et al., 200430. m/0.25 mm/0.15 μm, He, 35. C @ 10. min, 1.8 K/min, 220. C @ 10. min
CapillaryDB-Wax1813.Choi, 200360. m/0.25 mm/0.25 μm, N2, 70. C @ 2. min, 2. K/min, 230. C @ 20. min
CapillaryAT-Wax1785.Pino, Almora, et al., 200360. m/0.32 mm/0.25 μm, He, 65. C @ 10. min, 2. K/min, 250. C @ 60. min
CapillaryDB-Wax1812.Choi and Sawamura, 200060. m/0.25 mm/0.25 μm, N2, 70. C @ 2. min, 2. K/min, 230. C @ 20. min
CapillaryDB-Wax1805.Peng, 200015. m/0.53 mm/1. μm, He, 40. C @ 3. min, 5. K/min, 220. C @ 30. min
CapillaryHP-Wax1810.Peng, 200015. m/0.53 mm/1. μm, He, 40. C @ 3. min, 5. K/min, 220. C @ 30. min
CapillaryDB-Wax1804.Frohlich and Schreier, 199030. m/0.32 mm/0.25 μm, He, 40. C @ 3. min, 5. K/min; Tend: 220. C
PackedCarbowax 20M1800.van den Dool and Kratz, 1963Celite 545, 4.6 K/min; Tstart: 75. C; Tend: 228. C

Van Den Dool and Kratz RI, polar column, custom temperature program

View large format table.

Column type Active phase I Reference Comment
CapillaryStabilwax1804.Wang, Finn, et al., 200530. m/0.32 mm/1. μm, He; Program: 40C(2min) => 5C/min => 100C => 4C/min => 230C (10min)
CapillaryDB-Wax1793.Ferrari, Lablanquie, et al., 200460. m/0.25 mm/0.25 μm, He; Program: 35C(0.7min) => 20C/min => 70C => 4C/min => 240C

Normal alkane RI, non-polar column, temperature ramp

View large format table.

Column type Active phase I Reference Comment
CapillaryRTx-11501.Dib, Bendahou, et al., 201060. m/0.22 mm/0.25 μm, Helium, 2. K/min, 230. C @ 35. min; Tstart: 60. C
CapillaryHP-5 MS1523.Pino, Marquez, et al., 201030. m/0.32 mm/0.25 μm, Helium, 50. C @ 2. min, 4. K/min, 240. C @ 10. min
CapillaryBPX-51526.Dickschat, Bode, et al., 200525. m/0.22 mm/0.25 μm, He, 50. C @ 5. min, 5. K/min; Tend: 300. C
CapillaryHP-51526.8Leffingwell and Alford, 200560. m/0.32 mm/0.25 μm, He, 30. C @ 2. min, 2. K/min, 260. C @ 28. min
CapillaryHP-5MS1525.Tesevic, Nikicevic, et al., 200530. m/0.25 mm/0.25 μm, He, 4.3 K/min; Tstart: 60. C; Tend: 285. C
CapillaryDB-51521.Tellez, Khan, et al., 200430. m/0.25 mm/0.25 μm, He, 3. K/min; Tstart: 60. C; Tend: 240. C
CapillaryDB-11510.Krop, 200330. m/0.32 mm/0.25 μm, Helium, 10. K/min; Tstart: 160. C; Tend: 252. C
CapillaryDB-51533.da Camara, Shepherd, et al., 200230. m/0.25 mm/0.25 μm, He, 4. K/min; Tstart: 40. C; Tend: 290. C
CapillaryRSL-2001509.Jirovetz, Smith, et al., 200230. m/0.25 mm/0.25 μm, H2, 40. C @ 2. min, 6. K/min, 280. C @ 10. min
CapillarySPB-51525.Pino, Marbot, et al., 200230. m/0.25 mm/0.25 μm, Helium, 60. C @ 2. min, 4. K/min, 250. C @ 20. min
CapillaryOptima-11508.Brun, Bessière, et al., 200125. m/0.20 mm/0.25 μm, He, 50. C @ 3. min, 3. K/min; Tend: 250. C
CapillaryOptima-11508.de Beck, Bessière, et al., 200025. m/0.20 mm/0.25 μm, He, 50. C @ 3. min, 3. K/min; Tend: 250. C
CapillaryOV-1011507.Tamura, Boonbumrung, et al., 2000Nitrogen, 40. C @ 10. min, 2. K/min; Column length: 50. m; Column diameter: 0.25 mm; Tend: 200. C
CapillaryDB-11505.Guy and Vernin, 1996He, 70. C @ 5. min, 3. K/min; Column length: 30. m; Column diameter: 0.25 mm; Tend: 300. C
CapillaryDB-11506.Shiota, 199160. m/0.25 mm/0.25 μm, He, 3. K/min; Tstart: 50. C; Tend: 240. C
CapillaryDB-11509.Shiota, 199160. m/0.25 mm/0.25 μm, He, 3. K/min; Tstart: 50. C; Tend: 240. C
CapillarySE-301507.Heydanek and McGorrin, 1981He, 40. C @ 3. min, 3. K/min; Column length: 50. m; Column diameter: 0.5 mm; Tend: 170. C
CapillarySE-301510.Alves and Jennings, 1979Helium, 2. K/min; Tstart: 70. C; Tend: 170. C

Normal alkane RI, non-polar column, custom temperature program

View large format table.

Column type Active phase I Reference Comment
CapillaryPolydimethyl siloxane with 5 % Ph groups1525.Robinson, Adams, et al., 2012Program: not specified
CapillaryPolydimethyl siloxane with 5 % Ph groups1526.Robinson, Adams, et al., 2012Program: not specified
CapillarySiloxane, 5 % Ph1532.VOC BinBase, 2012Program: not specified
CapillaryPolydimethyl siloxane, 5 % phenyl1532.Skogerson, Wohlgemuth, et al., 2011Program: not specified
CapillaryRTx-11508.Dib, Bendahou, et al., 201060. m/0.22 mm/0.25 μm, Helium; Program: not specified
CapillaryHP-5 MS1526.Pino, Marquez, et al., 201030. m/0.32 mm/0.25 μm, Helium; Program: not specified
CapillaryHP-51521.Zhao, Li, et al., 200830. m/0.25 mm/0.25 μm; Program: 40 0C (2 min) 5 0C/min -> 80 0C 7 oC/min -> 160 0C 9 0C/min -> 200 0C 20 0C/min -> 280 0C (10 min)
CapillaryHP-51528.Zhao, Li, et al., 200830. m/0.25 mm/0.25 μm; Program: not specified
CapillarySE-301507.Vinogradov, 2004Program: not specified
CapillaryDB-51525.da Camara, Shepherd, et al., 200230. m/0.25 mm/0.25 μm, He; Program: not specified
CapillaryHP-5MS1528.Ansorena, Gimeno, et al., 200130. m/0.25 mm/0.25 μm, He; Program: 40C (10min) => 3C/min => 120C => 10C/min => 250C (5min)
CapillaryHP-51531.Ansorena, Astiasarán, et al., 200030. m/0.25 mm/0.25 μm, He; Program: 40C (10min) => 3C/min => 120C => 10C/min => 250C (5min)
CapillaryCP Sil 5 CB1517.Weyerstahl, Marschall, et al., 1998He; Column length: 25. m; Program: not specified
CapillaryOV-1011510.Zenkevich and Malamakhov, 1987He; Column length: 50. m; Column diameter: 0.24 mm; Program: not specified
CapillaryOV-11507.Waggott and Davies, 1984Hydrogen; Column length: 50. m; Column diameter: 0.32 mm; Program: not specified

Normal alkane RI, polar column, temperature ramp

View large format table.

Column type Active phase I Reference Comment
CapillaryHP-Innowax1808.Bousaada, Ammar, et al., 200830. m/0.25 mm/0.25 μm, Nitrogen, 50. C @ 1. min, 5. K/min, 280. C @ 1. min
CapillaryHP-Innowax1806.Soria, Sanz, et al., 200850. m/0.20 mm/0.20 μm, Helium, 45. C @ 2. min, 4. K/min, 190. C @ 50. min
CapillaryDB-Wax1770.Choi, 200660. m/0.25 mm/0.25 μm, N2, 70. C @ 2. min, 2. K/min, 230. C @ 20. min
CapillaryDB-Wax1814.Choi, 200460. m/0.25 mm/0.25 μm, N2, 70. C @ 2. min, 2. K/min, 230. C @ 20. min
CapillaryDB-Wax1814.Choi, 2004, 260. m/0.25 mm/0.25 μm, N2, 70. C @ 2. min, 2. K/min, 230. C @ 20. min
CapillaryTC-Wax1791.Suhardi, Suzuki, et al., 200260. m/0.25 mm/0.25 μm, He, 40. C @ 10. min, 3. K/min, 230. C @ 10. min
CapillaryDB-Wax1808.Tamura, Boonbumrung, et al., 2000Nitrogen, 40. C @ 10. min, 2. K/min; Column length: 60. m; Column diameter: 0.25 mm; Tend: 200. C
CapillarySP-10001811.De Llano D.G., Ramos M., et al., 199025. m/0.2 mm/0.43 μm, N2, 4. K/min, 190. C @ 30. min; Tstart: 60. C

Normal alkane RI, polar column, custom temperature program

View large format table.

Column type Active phase I Reference Comment
CapillaryCarbowax 20M1804.Lee, Chong, et al., 2012Program: not specified
CapillaryDB-Wax1793.Welke, Manfroi, et al., 201230. m/0.25 mm/0.25 μm, Helium; Program: not specified
CapillaryDB-Wax1809.Welke, Manfroi, et al., 201230. m/0.25 mm/0.25 μm, Helium; Program: not specified
CapillaryBP-201793.Pontes, Marques, et al., 200730. m/0.25 mm/0.25 μm, He; Program: 50C(1min) => 2.5C/min => 100C => 2C/min => 180C => 15C/min => 220C
CapillaryCarbowax 20M1785.Vinogradov, 2004Program: not specified
CapillaryHP-Innowax FSC1815.Erdemoglu, Sener, et al., 200360. m/0.25 mm/0.25 μm, He; Program: 60C(10min) => 4C/min => 220C(10min) => 1C/min => 240C
CapillaryDB-Wax1800.Peng, Yang, et al., 1991Program: not specified
CapillaryCarbowax 400, Carbowax 20M, Carbowax 1540, Carbowax 4000, Superox 06, PEG 20M, etc.1800.Waggott and Davies, 1984Hydrogen; Column length: 50. m; Column diameter: 0.32 mm; Program: not specified

Lee's RI, non-polar column, temperature ramp

View large format table.

Column type Active phase I Reference Comment
CapillaryDB-5MS258.35Chen, Keeran, et al., 200230. m/0.25 mm/0.5 μm, 40. C @ 1. min, 10. K/min; Tend: 310. C
CapillaryDB-5MS260.37Chen, Keeran, et al., 200230. m/0.25 mm/0.5 μm, 40. C @ 1. min, 4. K/min; Tend: 310. C
CapillaryDB-1265.9Johnson, Urso, et al., 199730. m/0.2 mm/0.25 μm, 50. C @ 2. min, 5. K/min, 300. C @ 5. min
CapillaryDB-1265.8Johnson, Urso, et al., 199730. m/0.2 mm/0.25 μm, 50. C @ 2. min, 5. K/min, 300. C @ 5. min
CapillaryDB-1265.9Johnson, Urso, et al., 199730. m/0.2 mm/0.25 μm, 50. C @ 2. min, 5. K/min, 300. C @ 5. min
CapillaryDB-5256.9Donnelly, Abdel-Hamid, et al., 199330. m/0.32 mm/0.25 μm, He, 40. C @ 3. min, 8. K/min, 285. C @ 29.5 min
CapillaryDB-5260.05Rostad and Pereira, 198630. m/0.26 mm/0.25 μm, He, 50. C @ 4. min, 6. K/min, 300. C @ 20. min

References

Freedman, Bagby, et al., 1989
Freedman, B.; Bagby, M.O.; Khoury, H., Correlation of heats of combustion with empirical formulas for fatty alcohols, J. Am. Oil Chem. Soc., 1989, 66, 595-596. [all data]

Adriaanse, Dekker, et al., 1965
Adriaanse, N.; Dekker, H.; Coops, J., Heats of combustion of normal saturated fatty acids and their methyl esters, Rec. Trav. Chim. Pays/Bas, 1965, 84, 393-407. [all data]

Gaikwad and Subrahmanyam, 1985
Gaikwad, B.R.; Subrahmanyam, V.V., Melting behavior of fatty alcohols and their binary blends., J. Indian Chem. Soc., 1985, 62, 513. [all data]

Adriaanse, Dekker, et al., 1964
Adriaanse, N.; Dekker, H.; Coops, J., Some Physical Constants of Normal, Saturated Fatty Acids and Their Methyl Esters, Recl. Trav. Chim. Pays-Bas, 1964, 83, 557. [all data]

Ambrose, 1963
Ambrose, D., Critical Temperatures of Some Phenols and Other Organic Compounds, Trans. Faraday Soc., 1963, 59, 1988. [all data]

Weast and Grasselli, 1989
CRC Handbook of Data on Organic Compounds, 2nd Editon, Weast,R.C and Grasselli, J.G., ed(s)., CRC Press, Inc., Boca Raton, FL, 1989, 1. [all data]

van Genderen, van Miltenburg, et al., 2002
van Genderen, Aad C.G.; van Miltenburg, J. Cees; Blok, Jacobus G.; van Bommel, Mark J.; van Ekeren, Paul J.; van den Berg, Gerrit J.K.; Oonk, Harry A.J., Liquid--vapour equilibria of the methyl esters of alkanoic acids: vapour pressures as a function of temperature and standard thermodynamic function changes, Fluid Phase Equilibria, 2002, 202, 1, 109-120, https://doi.org/10.1016/S0378-3812(02)00097-3 . [all data]

Bureau, Jose, et al., 2001
Bureau, N.; Jose, J.; Mokbel, I.; de Hemptinne, J-C, Vapour pressure measurements and prediction for heavy esters, The Journal of Chemical Thermodynamics, 2001, 33, 11, 1485-1498, https://doi.org/10.1006/jcht.2001.0859 . [all data]

Husain, Sarma, et al., 1993
Husain, Sajid; Sarma, P. Nageswara; Swamy, G.Y.S.K.; Devi, K. Sita, Determination of physicochemical properties of some fatty acid methyl esters by gas liquid chromatography, J Am Oil Chem Soc, 1993, 70, 2, 149-155, https://doi.org/10.1007/BF02542618 . [all data]

Stephenson and Malanowski, 1987
Stephenson, Richard M.; Malanowski, Stanislaw, Handbook of the Thermodynamics of Organic Compounds, 1987, https://doi.org/10.1007/978-94-009-3173-2 . [all data]

Rose and Schrodt, 1963
Rose, Arthur; Schrodt, Verle N., Correlation and Prediction of Vapor Pressures of Homologs. Use of Structure Parameters and Gas Chromatography Data., J. Chem. Eng. Data, 1963, 8, 1, 9-13, https://doi.org/10.1021/je60016a002 . [all data]

Spizzichino, 1956
Spizzichino, C., Contribution a l'etude des tensions de vapeur et des chaleurs de vaporisation des acides gras, esters methyliques et alcools gras a des pressions inferieures a 1 mm de mercure, J. des Recherches du C.N.R.S., 1956, 34, 1-24. [all data]

Scott, Macmillan, et al., 1952
Scott, T.A., Jr.; Macmillan, D.; Melvin, E.H., Vapor pressures and distillation of methyl esters of some fatty acids, Ind. Eng. Chem., 1952, 44, 172-175. [all data]

Althouse and Triebold, 1944
Althouse, Paul M.; Triebold, Howard O., Physical Constants of Methyl Esters of Commonly Occurring Fatty Acids Vapor Pressure, Ind. Eng. Chem. Anal. Ed., 1944, 16, 10, 605-606, https://doi.org/10.1021/i560134a003 . [all data]

Davies and Kybett, 1965
Davies, M.; Kybett, B., Sublimation and vaporization heats of long-chain alcohols, Trans. Faraday Soc., 1965, 61, 1608. [all data]

Kittiratanapiboon, Jeyashoke, et al., 1998
Kittiratanapiboon, K.; Jeyashoke, N.; Krisnangkura, K., The relationship of Kováts retention indices and equivalent chain lengths of fatty acid methyl esters on a methyl silicone capillary column, J. Chromatogr. Sci., 1998, 36, 7, 361-364, https://doi.org/10.1093/chromsci/36.7.361 . [all data]

Hanai and Hong, 1989
Hanai, T.; Hong, C., Structure-retention correlation in CGC, J. Hi. Res. Chromatogr., 1989, 12, 5, 327-332, https://doi.org/10.1002/jhrc.1240120517 . [all data]

Haken and Korhonen, 1984
Haken, J.K.; Korhonen, I.O.O., Gas chromatography of homologous esters. XXV. Capillary column studies of monochlorinated C5-C18 n-carboxylic esters, J. Chromatogr., 1984, 298, 89-100, https://doi.org/10.1016/S0021-9673(01)92697-4 . [all data]

Golovnya and Kuzmenko, 1977
Golovnya, R.V.; Kuzmenko, T.E., Thermodynamic evaluation of the interaction of fatty acid methyl esters with polar and non-polar stationary phases, based on their retention indices, Chromatographia, 1977, 10, 9, 545-548, https://doi.org/10.1007/BF02262915 . [all data]

Golovnya, Uralets, et al., 1976
Golovnya, R.V.; Uralets, V.P.; Kuzmenko, T.E., Characterization of fatty acid methyl esters by gas chromatography on siloxane liquid phases, J. Chromatogr., 1976, 121, 1, 118-121, https://doi.org/10.1016/S0021-9673(00)82312-2 . [all data]

Alissandrakis E., Tarantilis P.A., et al., 2007
Alissandrakis E.; Tarantilis P.A.; Harizanis P.C.; Polissiou M., Comparison of the volatile composition in thyme honeys from several origins in Greece, J. Agric. Food Chem., 2007, 55, 20, 8152-8157, https://doi.org/10.1021/jf071442y . [all data]

Krupcik, Matisova, et al., 1982
Krupcik, J.; Matisova, E.; Garaj, J.; Sojak, L.; Brezkin, V.G., Contribution of adsorption to retention data in glass capillary gas chromatography. Part. I. Polar stationary phases, Chromatographia, 1982, 16, 1, 166-168, https://doi.org/10.1007/BF02258890 . [all data]

MacLeod and Pieris, 1983
MacLeod, A.J.; Pieris, N.M., Volatile components of papaya (Carica papaya L.) with particular reference to glucosinolate products, J. Agric. Food Chem., 1983, 31, 5, 1005-1008, https://doi.org/10.1021/jf00119a021 . [all data]

Engel and Ratel, 2007
Engel, E.; Ratel, J., Correction of the data generated by mass spectrometry analyses of biological tissues: Application to food authentication, J. Chromatogr. A, 2007, 1154, 1-2, 331-341, https://doi.org/10.1016/j.chroma.2007.02.012 . [all data]

Quijano, Salamanca, et al., 2007
Quijano, C.E.; Salamanca, G.; Pino, J.A., Aroma volatile constituents of Colombian varieties of mango (Mangifera indica L.), Flavour Fragr. J., 2007, 22, 5, 401-406, https://doi.org/10.1002/ffj.1812 . [all data]

Flamini, Tebano, et al., 2006
Flamini, G.; Tebano, M.; Cioni, P.L.; Bagci, Y.; Dural, H.; Ertugrul, K.; Uysal, T.; Savran, A., A multivariate statistical approach to Centaurea classification using essential oil composition data of some species from Turkey, Pl. Syst. Evol., 2006, 261, 1-4, 217-228, https://doi.org/10.1007/s00606-006-0448-3 . [all data]

Pino, Mesa, et al., 2005
Pino, J.A.; Mesa, J.; Muñoz, Y.; Martí, M.P.; Marbot, R., Volatile components from mango (Mangifera indica L.) cultivars, J. Agric. Food Chem., 2005, 53, 6, 2213-2223, https://doi.org/10.1021/jf0402633 . [all data]

Pino, Almora, et al., 2003
Pino, J.; Almora, K.; Marbot, R., Volatile components of papaya (Carica papaya L., maradol variety) fruit, Flavour Fragr. J., 2003, 18, 6, 492-496, https://doi.org/10.1002/ffj.1248 . [all data]

Sun and Stremple, 2003
Sun, G.; Stremple, P., Retention index characterization of flavor, fragrance, and many other compounds on DB-1 and DB-XLB, 2003, retrieved from http://www.chem.agilent.com/cag/cabu/pdf/b-0279.pdf. [all data]

Lazari, Skaltsa, et al., 2000
Lazari, D.M.; Skaltsa, H.D.; Constantinidis, T., Volatile constituents of Centaurea pelia DC., C. thessala Hausskn. subsp. drakiensis (Freyn Sint.) Georg. and C. zuccariniana DC. from Greece, Flavour Fragr. J., 2000, 15, 1, 7-11, https://doi.org/10.1002/(SICI)1099-1026(200001/02)15:1<7::AID-FFJ860>3.0.CO;2-3 . [all data]

Valero, Sanz, et al., 1999
Valero, E.; Sanz, J.; Martinez-Castro, I., Volatile components in microwave- and conventionally-heated milk, Food Chem., 1999, 66, 3, 333-338, https://doi.org/10.1016/S0308-8146(99)00069-2 . [all data]

Johnson, Urso, et al., 1997
Johnson, C.I.; Urso, A.; Geleta, L., Broad spectrum analysis of municipal and industrial effluents discharged into the Peace, Athabasca and Slave river basins: characterization of effluent samples, 1994 - Volume 1 of 2, Northern River Basins Study Project Report No. 121, Norther River Basins Study, Edmonton, Alberta, 1997, 27. [all data]

de Frutos, Sanz, et al., 1991
de Frutos, M.; Sanz, J.; Martinez-Castro, I., Characterization of artisanal cheeses by GC and GC/MS analysis of their medium volatility (SDE) fraction, J. Agric. Food Chem., 1991, 39, 3, 524-530, https://doi.org/10.1021/jf00003a019 . [all data]

Tan, Wilkins, et al., 1989
Tan, S.T.; Wilkins, A.L.; Holland, P.T.; McGhie, T.K., Extractives from New Zealand unifloral honeys. 2. Degraded carotenoids and other substances from heather honey, J. Agric. Food Chem., 1989, 37, 5, 1217-1221, https://doi.org/10.1021/jf00089a004 . [all data]

Rostad and Pereira, 1986
Rostad, C.E.; Pereira, W.E., Kovats and Lee retention indices determined by gas chromatography/mass spectrometry for organic compounds of environmental interest, J. Hi. Res. Chromatogr. Chromatogr. Comm., 1986, 9, 6, 328-334, https://doi.org/10.1002/jhrc.1240090603 . [all data]

Weber, 1986
Weber, L., Utilization of the Sadtler standard RI system in micropollution analyses, J. Hi. Res. Chromatogr. Chromatogr. Comm., 1986, 9, 8, 446-451, https://doi.org/10.1002/jhrc.1240090806 . [all data]

van den Dool and Kratz, 1963
van den Dool, H.; Kratz, P. Dec., A generalization of the retention index system including linear temperature programmed gas-liquid partition chromatography, J. Chromatogr., 1963, 11, 463-471, https://doi.org/10.1016/S0021-9673(01)80947-X . [all data]

Tret'yakov, 2007
Tret'yakov, K.V., Retention Data. NIST Mass Spectrometry Data Center., NIST Mass Spectrometry Data Center, 2007. [all data]

Wang, Finn, et al., 2005
Wang, Y.; Finn, C.; Qian, M.C., Impact of Growing Environment on Chickasaw Blackberry ( Rubus L.) Aroma Evaluated by Gas Chromatography Olfactometry Dilution Analysis, J. Agric. Food Chem., 2005, 53, 9, 3563-3571, https://doi.org/10.1021/jf048102m . [all data]

Isidorov, Krajewska, et al., 2001
Isidorov, V.A.; Krajewska, U.; Dubis, E.N.; Jdanova, M.A., Partition coefficients of alkyl aromatic hydrocarbons and esters in a hexane-acetonitrile system, J. Chromatogr. A, 2001, 923, 1-2, 127-136, https://doi.org/10.1016/S0021-9673(01)00929-3 . [all data]

Eri, Khoo, et al., 2000
Eri, S.; Khoo, B.K.; Lech, J.; Hartman, T.G., Direct thermal desorption-gas chromatography and gas chromatography-mass spectrometry profiling of hop (Humulus lupulus L.) essential oils in support of varietal characterization, J. Agric. Food Chem., 2000, 48, 4, 1140-1149, https://doi.org/10.1021/jf9911850 . [all data]

Peng, 2000
Peng, C.T., Prediction of retention indices. V. Influence of electronic effects and column polarity on retention index, J. Chromatogr. A, 2000, 903, 1-2, 117-143, https://doi.org/10.1016/S0021-9673(00)00901-8 . [all data]

Peng, Ding, et al., 1988
Peng, C.T.; Ding, S.F.; Hua, R.L.; Yang, Z.C., Prediction of Retention Indexes I. Structure-Retention Index Relationship on Apolar Columns, J. Chromatogr., 1988, 436, 137-172, https://doi.org/10.1016/S0021-9673(00)94575-8 . [all data]

Ledauphin, Saint-Clair, et al., 2004
Ledauphin, J.; Saint-Clair, J.-F.; Lablanquie, O.; Guichard, H.; Founier, N.; Guichard, E.; Barillier, D., Identification of trace volatile compounds in freshly distilled calvados and cognac using preparative separations coupled with gas chromatography-mass spectrometry, J. Agric. Food Chem., 2004, 52, 16, 5124-5134, https://doi.org/10.1021/jf040052y . [all data]

Choi, 2003
Choi, H.-S., Character impact odorants of Citrus Hallabong [(C. unshiu Marcov × C. sinensis Osbeck) × C. reticulata Blanco] cold-pressed peel oil, J. Agric. Food Chem., 2003, 51, 9, 2687-2692, https://doi.org/10.1021/jf021069o . [all data]

Choi and Sawamura, 2000
Choi, H.-S.; Sawamura, M., Composition of the essential oil of Citrus tamurana Hort. ex Tanaka (Hyuganatsu), J. Agric. Food Chem., 2000, 48, 10, 4868-4873, https://doi.org/10.1021/jf000651e . [all data]

Frohlich and Schreier, 1990
Frohlich, O.; Schreier, P., Volatile Constituents of Loquat (Eriobotrya japonica Lindl.) Fruit, J. Food Sci., 1990, 55, 1, 176-180, https://doi.org/10.1111/j.1365-2621.1990.tb06046.x . [all data]

Ferrari, Lablanquie, et al., 2004
Ferrari, G.; Lablanquie, O.; Cantagrel, R.; Ledauphin, J.; Payot, T.; Fournier, N.; Guichard, E., Determination of key odorant compounds in freshly distilled cognac using GC-O, GC-MS, and sensory evaluation, J. Agric. Food Chem., 2004, 52, 18, 5670-5676, https://doi.org/10.1021/jf049512d . [all data]

Dib, Bendahou, et al., 2010
Dib, M.A.; Bendahou, M.; Bendiabdellah, A.; Djabou, N.; Allali, H.; Tabti, B.; Paolini, J.; Costa, J., Partial chemical composition and antimicrobial activity of Daucus crinitus Desf. extracts, Grasas y Aceites, 2010, 61, 3, 271-278, https://doi.org/10.3989/gya.122609 . [all data]

Pino, Marquez, et al., 2010
Pino, J.A.; Marquez, E.; Quijano, C.E.; Castro, D., Volatile compounds in noni (Morinda citrifolia L.) at two ripening stages, Ciencia e Technologia de Alimentos, 2010, 30, 1, 183-187, https://doi.org/10.1590/S0101-20612010000100028 . [all data]

Dickschat, Bode, et al., 2005
Dickschat, J.S.; Bode, H.B.; Kroppenstedt, R.M.; Müller, R.; Schulz, S., Biosynthesis of iso-fatty acids in myxobacteria, Org. Biomol. Chem., 2005, 3, 15, 2824-2831, https://doi.org/10.1039/b504889c . [all data]

Leffingwell and Alford, 2005
Leffingwell, J.C.; Alford, E.D., Volatile constituents of Perique tobacco, Electron. J. Environ. Agric. Food Chem., 2005, 4, 2, 899-915. [all data]

Tesevic, Nikicevic, et al., 2005
Tesevic, V.; Nikicevic, N.; Jovanovic, A.; Djokovic, D.; Vujisic, L.; Vuckovic, I.; Bonic, M., Volatile components from old plum brandies, Food Technol. Biotechnol., 2005, 43, 4, 367-372. [all data]

Tellez, Khan, et al., 2004
Tellez, M.R.; Khan, I.A.; Schaneberg, B.T.; Crockett, S.L.; Rimando, A.M.; Kobaisy, M., Steam distillation-solid-phase microextraction for the detection of Ephedra sinica in herbal preparations, J. Chromatogr. A, 2004, 1025, 1, 51-56, https://doi.org/10.1016/S0021-9673(03)01035-5 . [all data]

Krop, 2003
Krop, H.B., Thermodynamic approaches for the environmental chemistry of organic pollutants (Dissertation), 2003. [all data]

da Camara, Shepherd, et al., 2002
da Camara, C.A.G.; Shepherd, S.L.K.; Joaquim, D.R.G., Análise químnica da cultura de tecidos do híbrido Clusia paralicola X Clusia weddelliana, Revista Brasileira de Farmacognosia, 2002, 12, 26-28, https://doi.org/10.1590/S0102-695X2002000300013 . [all data]

Jirovetz, Smith, et al., 2002
Jirovetz, L.; Smith, D.; Buchbauer, G., Aroma compound analysis of Eruca sativa (Brassicaceae) SPME headspace leaf samples using GC, GC-MS, and olfactometry, J. Agric. Food Chem., 2002, 50, 16, 4643-4646, https://doi.org/10.1021/jf020129n . [all data]

Pino, Marbot, et al., 2002
Pino, J.A.; Marbot, R.; Vazquez, C., Characterization of volatiles in Loquat fruit (Eriobotrya japonica Lindl.), Revista CENIC Ciencias Quimicas, 2002, 33, 3, 115-119. [all data]

Brun, Bessière, et al., 2001
Brun, G.; Bessière, J.-M.; Dijoux-Franca, M.-G.; David, B.; Mariotte, A.-M., Volatile components of Catharanthus roseus (L.) G. Don (Apocynaceae), Flavour Fragr. J., 2001, 16, 2, 116-119, https://doi.org/10.1002/ffj.958 . [all data]

de Beck, Bessière, et al., 2000
de Beck, P.O.; Bessière, J.M.; Dijoux-Franca, M.-G.; David, B.; Mariotte, A.-M., Volatile constituents from leaves and wood of Leea guineensis G. Don (Leeaceae) from Cameroon, Flavour Fragr. J., 2000, 15, 3, 182-185, https://doi.org/10.1002/1099-1026(200005/06)15:3<182::AID-FFJ888>3.0.CO;2-X . [all data]

Tamura, Boonbumrung, et al., 2000
Tamura, H.; Boonbumrung, S.; Yoshizawa, T.; Varanyanond, W., Volatile components of the essential oil in the pulp of four yellow mangoes (Mangifera indica L.) in Thailand, Food Sci. Technol. Res., 2000, 6, 1, 68-73, https://doi.org/10.3136/fstr.6.68 . [all data]

Guy and Vernin, 1996
Guy, I.; Vernin, G., Minor compounds from Cistus ladaniferus L. essential oil from esterel. 2. Acids and phenols, J. Essent. Oil Res., 1996, 8, 4, 455-462, https://doi.org/10.1080/10412905.1996.9700666 . [all data]

Shiota, 1991
Shiota, H., Volatile components of pawpaw fruit (Asimina triloba Dunal.), J. Agric. Food Chem., 1991, 39, 9, 1631-1635, https://doi.org/10.1021/jf00009a019 . [all data]

Heydanek and McGorrin, 1981
Heydanek, M.G.; McGorrin, R.J., Gas chromatography-mass spectroscopy investigations on the flavor chemistry of oat groats, J. Agric. Food Chem., 1981, 29, 5, 950-954, https://doi.org/10.1021/jf00107a016 . [all data]

Alves and Jennings, 1979
Alves, S.; Jennings, W.G., Volatile composition of certain Amazonian fruits, Food Chem., 1979, 4, 2, 149-159, https://doi.org/10.1016/0308-8146(79)90039-6 . [all data]

Robinson, Adams, et al., 2012
Robinson, A.L.; Adams, D.O.; Boss, P.K.; Heymann, H.; Solomon, P.S.; Trengove, R.D., Influence of geographic origine on the sensory characteristics and wine composition of Vitus viniferas cv. Cabernet Sauvignon wines from Australia (Supplemental data), Am. J. Enol. Vitic., 2012, 64, 4, 467-476, https://doi.org/10.5344/ajev.2012.12023 . [all data]

VOC BinBase, 2012
VOC BinBase, The volatile compound BinBase (VOC BinBase), 2012, retrieved from http://fiehnlab.ucdavis.edu/projects/VocBinBase and http://binbase.sourceforge.net. [all data]

Skogerson, Wohlgemuth, et al., 2011
Skogerson, K.; Wohlgemuth, G.; Fiehn, O., VocBinNase, 2011, retrieved from http://fiehnlab.ucdavis.edu/projects//VocBinBase. [all data]

Zhao, Li, et al., 2008
Zhao, Y.; Li, J.; Xu, Y.; Duan, H.; Fan, W.; Zhao, G., EXtraction, preparation and identification of volatile compounds in Changyu XO brandy, Chinese J. Chromatogr., 2008, 26, 2, 212-222, https://doi.org/10.1016/S1872-2059(08)60014-0 . [all data]

Vinogradov, 2004
Vinogradov, B.A., Production, composition, properties and application of essential oils, 2004, retrieved from http://viness.narod.ru. [all data]

Ansorena, Gimeno, et al., 2001
Ansorena, D.; Gimeno, O.; Astiasarán, I.; Bello, J., Analysis of volatile compounds by GC-MS of a dry fermented sausage: chorizo de Pamplona, Food Res. Int., 2001, 34, 1, 67-75, https://doi.org/10.1016/S0963-9969(00)00133-2 . [all data]

Ansorena, Astiasarán, et al., 2000
Ansorena, D.; Astiasarán, I.; Bello, J., Influence of the simultaneous addition of the protease flavourzyme and the lipase novozyme 677BG on dry fermented sausage compounds extracted by SDE and analyzed by GC-MS, J. Agric. Food Chem., 2000, 48, 6, 2395-2400, https://doi.org/10.1021/jf990931y . [all data]

Weyerstahl, Marschall, et al., 1998
Weyerstahl, P.; Marschall, H.; Weirauch, M.; Thefeld, K.; Surburg, H., Constituents of commercial Labdanum oil, Flavour Fragr. J., 1998, 13, 5, 295-318, https://doi.org/10.1002/(SICI)1099-1026(1998090)13:5<295::AID-FFJ751>3.0.CO;2-I . [all data]

Zenkevich and Malamakhov, 1987
Zenkevich, I.G.; Malamakhov, A.C., Evaluation of Molecular Weights of Organic Compounds based on Retention Parameters at Chromato-Spectral Analysys. Additional Criterion of Molecular Ions' Identification, Vestn. St. Petersb. Univ. Ser. 4: Fiz. Khim, 1987, 2, 101-106. [all data]

Waggott and Davies, 1984
Waggott, A.; Davies, I.W., Identification of organic pollutants using linear temperature programmed retention indices (LTPRIs) - Part II, 1984, retrieved from http://dwi.defra.gov.uk/research/completed-research/reports/dwi0383.pdf. [all data]

Bousaada, Ammar, et al., 2008
Bousaada, O.; Ammar, S.; Saidana, D.; Chriaa, J.; Chraif, I.; Daami, M.; Helal, A.N.; Mighri, Z., Chemical composition and antimicrobial activity of volatile components from capitula and aerial parts of Rhaponticum acaule DC growing wild in Tunisia, Microbiol. Res., 2008, 163, 1, 87-95, https://doi.org/10.1016/j.micres.2007.02.010 . [all data]

Soria, Sanz, et al., 2008
Soria, A.C.; Sanz, J.; Martinez-Castro, I., SPME followed by GC-MS: a powerful technique for qualitative analysis of honey volatiles, Eur. Food Res. Technol., 2008, 1-12. [all data]

Choi, 2006
Choi, H.-S., Headspace analyses of fresh leaves and stems of Angelica gigas Nakai, a Korean medicinal herb, Flavour Fragr. J., 2006, 21, 4, 604-608, https://doi.org/10.1002/ffj.1602 . [all data]

Choi, 2004
Choi, H.-S., Volatile constituents of satsuma mandarins growing in Korea, Flavour Fragr. J., 2004, 19, 5, 406-412, https://doi.org/10.1002/ffj.1283 . [all data]

Choi, 2004, 2
Choi, H.-S., Aroma evaluation of an aquatic herb, changpo (Acorus calamus Var. angustatus Bess), by AEDA and SPME, J. Agric. Food Chem., 2004, 52, 26, 8099-8104, https://doi.org/10.1021/jf040239p . [all data]

Suhardi, Suzuki, et al., 2002
Suhardi, S.; Suzuki, M.; Yoshida, K.; Muto, T.; Fujita, A.; Watanbe, N., Changes in the volatile compounds and in the chemical and physical properties of snake fruit (Salacca edulis Reinw) Cv. Pondoh during maturation, J. Agric. Food Chem., 2002, 50, 26, 7627-7633, https://doi.org/10.1021/jf020620e . [all data]

De Llano D.G., Ramos M., et al., 1990
De Llano D.G.; Ramos M.; Polo C.; Sanz J.; Martinez-Castro I., Evolution of the volatile components of an artisanal blue cheese during ripening, J. Dairy Sci., 1990, 73, 7, 1676-1683, https://doi.org/10.3168/jds.S0022-0302(90)78842-X . [all data]

Lee, Chong, et al., 2012
Lee, P.-R.; Chong, I.S.-M.; Yu, B.; Curran, P.; Liu, S.-Q., Effect of precursors on volatile compounds in Papaya wine fermented by mixed yeasts, Uncorrected proof, 2012, 000-000. [all data]

Welke, Manfroi, et al., 2012
Welke, J.E.; Manfroi, V.; Zanus, M.; Lazarotto, M.; Zini, C.A., Characterization of the volatile profile of Brazilian merlot wines through comprehensive two dimensional gas chromatography time-of-flight mass spectrometric detection, J. Chromatogr. A, 2012, 1226, 124-139, https://doi.org/10.1016/j.chroma.2012.01.002 . [all data]

Pontes, Marques, et al., 2007
Pontes, M.; Marques, J.C.; Camara, J.S., Screening of volatile composition from Portuguese multifloral honeys using headspace solid-phase microextraction-gas chromatography-quadrupole mass spectrometry, Talanta, 2007, 74, 1, 91-103, https://doi.org/10.1016/j.talanta.2007.05.037 . [all data]

Erdemoglu, Sener, et al., 2003
Erdemoglu, N.; Sener, B.; Demirci, B.; Baser, K.H.C., The glycosidically bound volatile compounds of Taxus baccata, Chem. Nat. Compd. (Engl. Transl.), 2003, 39, 2, 195-198, https://doi.org/10.1023/A:1024870031960 . [all data]

Peng, Yang, et al., 1991
Peng, C.T.; Yang, Z.C.; Ding, S.F., Prediction of rentention idexes. II. Structure-retention index relationship on polar columns, J. Chromatogr., 1991, 586, 1, 85-112, https://doi.org/10.1016/0021-9673(91)80028-F . [all data]

Chen, Keeran, et al., 2002
Chen, P.H.; Keeran, W.S.; Van Ausdale, W.A.; Schindler, D.R.; Roberts, D.W., Application of Lee retention indices to the confirmation of tentatively identified compounds from GC/MS analysis of environmental samples, Technical paper, Analytical Services Division, Environmental ScienceEngineering, Inc, PO Box 1703, Gainesville, FL 32602, 2002, 11. [all data]

Donnelly, Abdel-Hamid, et al., 1993
Donnelly, J.R.; Abdel-Hamid, M.S.; Jeter, J.L.; Gurka, D.F., Application of gas chromatographic retention properties to the identification of environmental contaminants, J. Chromatogr., 1993, 642, 1-2, 409-415, https://doi.org/10.1016/0021-9673(93)80106-I . [all data]