5,9,13-Pentadecatrien-2-one, 6,10,14-trimethyl-, (E,E)-

Normal alkane RI, polar column, custom temperature program

Data compiled by: NIST Mass Spectrometry Data Center, William E. Wallace, director

Column type CapillaryCapillaryCapillaryCapillaryCapillary
Active phase HP-InnowaxHP-Innowax FSCInnowax FSCHP-Innowax FSCHP-Innowax FSC
Column length (m) 60.60.60.60.60.
Carrier gas N2HeHeHeHe
Substrate
Column diameter (mm) 0.250.250.250.250.25
Phase thickness (μm) 0.250.250.250.250.25
Program 60C(10min) => 4C/min => 220C(10min) => 1C/min => 240C60C(10min) => 4C/min => 220C(10min) => 1C/min => 240C60C(10min) => 4C/min => 220C(10min) => 1C/min => 240C60C (10min) => 4C/min => 220C (10min) => 1C/min => 240C60C(10min) => 4C/min => 220C(10min) => 1C/min => 240C
I 2384.2386.2384.2386.2386.
ReferenceDuman, Kartal, et al., 2005Sezik E., Kocakulak E., et al., 2005Baser, Özek, et al., 2004Demirci, Baser, et al., 2003Erdemoglu, Sener, et al., 2003
Comment MSDC-RI MSDC-RI MSDC-RI MSDC-RI MSDC-RI
Column type CapillaryCapillaryCapillaryCapillaryCapillary
Active phase Innowax FSCInnowax FSCInnowaxSupelcowax 10Supelcowax 10
Column length (m) 60.60.60.60.60.
Carrier gas HeHe HeliumHelium
Substrate
Column diameter (mm) 0.250.250.250.250.25
Phase thickness (μm) 0.250.250.250.250.25
Program 60C(10min) => 4C/min => 220C(10min) => 1C/min => 240C60C(10 min) => 4C/min => 220C(10min) => 1C/min => 240C60C(10min) => 4C/min => 220C(10min) => 1C/min => 240C60 0C (10 min) 2 0C/min -> 80 0C 3 0C/min -> 100 0C 4 0C/min -> 220 0C (30 min)not specified
I 2384.2384.2384.2364.2375.
ReferenceTabanca N., Demirci F., et al., 2001Kirimer, Tabanca, et al., 2000Baser, Kürkcüoglu, et al., 1998Castioni and Kapetanidis, 1996Castioni and Kapetanidis, 1996
Comment MSDC-RI MSDC-RI MSDC-RI MSDC-RI MSDC-RI
Column type Capillary
Active phase Supelcowax 10
Column length (m) 60.
Carrier gas Helium
Substrate
Column diameter (mm) 0.25
Phase thickness (μm) 0.25
Program not specified
I 2376.
ReferenceCastioni and Kapetanidis, 1996
Comment MSDC-RI

Kovats' RI, non-polar column, custom temperature program

Data compiled by: NIST Mass Spectrometry Data Center, William E. Wallace, director

Column type CapillaryCapillary
Active phase HP-5HP-5
Column length (m) 30.30.
Carrier gas HeHe
Substrate
Column diameter (mm) 0.250.25
Phase thickness (μm) 0.250.25
Program 50 C 20 C/min -> 70 C 9 C/min -> 280 C50 0C 20 K/min -> 70 0C 9 K/min -> 280 0C
I 1927.1927.
ReferencePalic, Stojanovic, et al., 2002Stojanovic, Palic, et al., 2000
Comment MSDC-RI MSDC-RI

Normal alkane RI, non-polar column, temperature ramp

Data compiled by: NIST Mass Spectrometry Data Center, William E. Wallace, director

Column type CapillaryCapillaryCapillaryCapillaryCapillary
Active phase HP-5 MSHP-5OV-1HP-5HP-5 MS
Column length (m) 30.30.30.30.30.
Carrier gas HeliumHeliumHeliumHeliumHelium
Substrate
Column diameter (mm) 0.250.250.250.320.25
Phase thickness (μm) 0.250.250.250.250.25
Tstart (C) 50.50.50.60.70.
Tend (C) 250.300.250.240.290.
Heat rate (K/min) 5.50.5.3.5.
Initial hold (min) 0.55.3.2.
Final hold (min) 0.55.2. 10.
I 1881.1886.1893.1917.1921.
ReferenceFanaro, Duarte, et al., 2012Bi Kouame, Bedi, et al., 2010Hu, Liang, et al., 2010Kahriman, Tosun, et al., 2010Radulovic, Blagojevic, et al., 2010
Comment MSDC-RI MSDC-RI MSDC-RI MSDC-RI MSDC-RI
Column type CapillaryCapillaryCapillaryCapillaryCapillary
Active phase DB-1HP-5 MSHP-5 MSHP-5MSHP-5
Column length (m) 30.30.30.30.30.
Carrier gas HeliumHeliumHeliumHeHelium
Substrate
Column diameter (mm) 0.250.250.250.250.25
Phase thickness (μm) 0.250.250.250.250.25
Tstart (C) 50.50.50.60.40.
Tend (C) 220.280.240.250.260.
Heat rate (K/min) 4.4.3.2.4.
Initial hold (min) 2.  8.
Final hold (min) 2.  15.
I 1892.1919.1933.1911.1911.
ReferenceXu, Tang, et al., 2010Zhao, Zeng, et al., 2009Sarikurkcu, Tepe, et al., 2008Ferhat, Tigrine-Kordjani, et al., 2007Ristic, Krivokuca-Dokic, et al., 2007
Comment MSDC-RI MSDC-RI MSDC-RI MSDC-RI MSDC-RI
Column type CapillaryCapillaryCapillaryCapillaryCapillary
Active phase PE-5HP-5 MSHP-5HP-5Optima-1
Column length (m) 50.30.60.30.25.
Carrier gas HeHeliumHeHeHe
Substrate
Column diameter (mm) 0.320.250.320.320.20
Phase thickness (μm) 0.250.250.250.250.25
Tstart (C) 100.60.30.60.50.
Tend (C) 280.250.260.260.250.
Heat rate (K/min) 3.2.2.5.3.
Initial hold (min) 1.8.2.2.3.
Final hold (min)  15.28.13.
I 1930.1911.1922.41919.1895.
ReferencePandey-Rai S., Mallavarapu G.R., et al., 2006Tigrine-Kordiani, Meklati, et al., 2006Leffingwell and Alford, 2005Yayli, Yasar, et al., 2005Brun, Bessière, et al., 2001
Comment MSDC-RI MSDC-RI MSDC-RI MSDC-RI MSDC-RI
Column type Capillary
Active phase Optima-1
Column length (m) 25.
Carrier gas He
Substrate
Column diameter (mm) 0.20
Phase thickness (μm) 0.25
Tstart (C) 50.
Tend (C) 250.
Heat rate (K/min) 3.
Initial hold (min) 3.
Final hold (min)
I 1895.
Referencede Beck, Bessière, et al., 2000
Comment MSDC-RI

Normal alkane RI, polar column, temperature ramp

Data compiled by: NIST Mass Spectrometry Data Center, William E. Wallace, director

Column type CapillaryCapillaryCapillaryCapillary
Active phase CarbowaxCarbowax-PEGHP Innowax FSPInnowax
Column length (m) 60.60.60.60.
Carrier gas HeHeliumHeHe
Substrate
Column diameter (mm) 0.20.200.250.25
Phase thickness (μm) 0.250.250.250.25
Tstart (C) 60.60.60.60.
Tend (C) 250.250.220.220.
Heat rate (K/min) 2.2.
Initial hold (min) 8.8.10.10.
Final hold (min) 15.15.10.
I 2376.2376.2384.2384.
ReferenceFerhat, Tigrine-Kordjani, et al., 2007Tigrine-Kordiani, Meklati, et al., 2006Kaya, Baser, et al., 1999Kaya, Baser, et al., 1999, 2
Comment MSDC-RI MSDC-RI MSDC-RI MSDC-RI

References

Duman, Kartal, et al., 2005
Duman, H.; Kartal, M.; Altun, L.; Demirci, B.; Baser, K.H.C., The essential oil of Stachys laetivirens Kotschy Boiss. ex Rech. fil., endemic in Turkey, Flavour Fragr. J., 2005, 20, 1, 48-50, https://doi.org/10.1002/ffj.1362 . [all data]

Sezik E., Kocakulak E., et al., 2005
Sezik E.; Kocakulak E.; Baser K.H.C.; Ozek T., Composition of the essential oils of Juniperus oxycedrus subsp macrocarpa from Turkey, Chem. Nat. Compd. (Engl. Transl.), 2005, 41, 3, 352-354, https://doi.org/10.1007/s10600-005-0149-0 . [all data]

Baser, Özek, et al., 2004
Baser, K.H.C.; Özek, T.; Kirimer, N.; Deliorman, D.; Ergun, F., Composition of the essential oils of Galium aparine L. and Galium odoratum (L.) Scop. from Turkey, J. Essent. Oil Res., 2004, 16, 4, 305-307, https://doi.org/10.1080/10412905.2004.9698728 . [all data]

Demirci, Baser, et al., 2003
Demirci, B.; Baser, K.H.C.; Yildiz, B.; Bahcecioglu, Z., Composition of the essential oils of six endemic Salvia spp. from Turkey, Flavour Fragr. J., 2003, 18, 2, 116-121, https://doi.org/10.1002/ffj.1173 . [all data]

Erdemoglu, Sener, et al., 2003
Erdemoglu, N.; Sener, B.; Demirci, B.; Baser, K.H.C., The glycosidically bound volatile compounds of Taxus baccata, Chem. Nat. Compd. (Engl. Transl.), 2003, 39, 2, 195-198, https://doi.org/10.1023/A:1024870031960 . [all data]

Tabanca N., Demirci F., et al., 2001
Tabanca N.; Demirci F.; Ozek T.; Tumen G.; Baser K.H.C., Composition and antimicrobial activity of the essential oil of Origanum x dolichosiphon P. H. Davis, Chem. Nat. Compd. (Engl. Transl.), 2001, 37, 3, 238-241, https://doi.org/10.1023/A:1012513922871 . [all data]

Kirimer, Tabanca, et al., 2000
Kirimer, N.; Tabanca, N.; Özek, T.; Tümen, G.; Baser, K.H.C., Essential oils of annual Sideritis species growing in Turkey, Pharm. Biol., 2000, 38, 2, 106-111, https://doi.org/10.1076/1388-0209(200004)3821-1FT106 . [all data]

Baser, Kürkcüoglu, et al., 1998
Baser, K.H.C.; Kürkcüoglu, M.; Aytac, Z., Composition of the essential oil of Salvia euphratica Montbret ex Bentham var. euphratica from Turkey, Flavour Fragr. J., 1998, 13, 1, 63-64, https://doi.org/10.1002/(SICI)1099-1026(199801/02)13:1<63::AID-FFJ694>3.0.CO;2-Z . [all data]

Castioni and Kapetanidis, 1996
Castioni, P.; Kapetanidis, I., Volatile constituents from Brunfelsia grandiflora ssp. grandiflora: qualitative analysis by GC-MS, Scientia Pharmaceutica, 1996, 64, 83-91. [all data]