Tricyanophosphine

Phase change data

Data compiled by: William E. Acree, Jr., James S. Chickos

Quantity Value Units Method Reference Comment
Δsub75.3 ± 2.9kJ/molN/AAl-Maydama, 1995See also Davies, Finch, et al., 1976.

Enthalpy of sublimation

ΔsubH (kJ/mol) Temperature (K) Method Reference Comment
78.3308.MEStephenson and Malanowski, 1987Based on data from 293. - 323. K. See also Davies, Finch, et al., 1976.

References

Al-Maydama, 1995
Al-Maydama, H., The enthalpies of formation of bis(dimethylamino)cyanophosphine, (dimethylamino)dicyanophosphine, and tricyanophosphine, The Journal of Chemical Thermodynamics, 1995, 27, 6, 575-584, https://doi.org/10.1006/jcht.1995.0059 . [all data]

Davies, Finch, et al., 1976
Davies, R. Hugh; Finch, Arthur; Gardner, Peter J.; Hameed, Abdul; Stephens, Michael, The standard enthalpies of hydrolysis and formation of tricyanophosphine, J. Chem. Soc., Dalton Trans., 1976, 6, 556, https://doi.org/10.1039/dt9760000556 . [all data]

Stephenson and Malanowski, 1987
Stephenson, Richard M.; Malanowski, Stanislaw, Handbook of the Thermodynamics of Organic Compounds, 1987, https://doi.org/10.1007/978-94-009-3173-2 . [all data]