1-Propanol, 3-ethoxy-

Van Den Dool and Kratz RI, polar column, temperature ramp

Data compiled by: NIST Mass Spectrometry Data Center, William E. Wallace, director

Column type CapillaryCapillaryCapillaryCapillaryCapillary
Active phase InnowaxZB-WaxDB-FFAPSupelcowax-10Supelcowax-10
Column length (m) 60.30.30.60.60.
Carrier gas HeHeH2HeHe
Substrate
Column diameter (mm) 0.250.250.320.250.25
Phase thickness (μm) 0.250.150.250.250.25
Tstart (C) 40.35.40.35.35.
Tend (C) 230.220.240.195.195.
Heat rate (K/min) 4.1.85.2.2.
Initial hold (min) 4.10.2. 5.
Final hold (min) 20.10. 90.90.
I 1364.1370.1376.1377.1377.
ReferenceLee, Lee, et al., 2006Ledauphin, Saint-Clair, et al., 2004Charles, Martin, et al., 2000Chung, 2000Chung, 1999
Comment MSDC-RI MSDC-RI MSDC-RI MSDC-RI MSDC-RI

Kovats' RI, non-polar column, isothermal

Data compiled by: NIST Mass Spectrometry Data Center, William E. Wallace, director

Column type PackedPacked
Active phase Apiezon LApiezon L
Column length (m)
Carrier gas
Substrate Celite 545Celite 545
Column diameter (mm)
Phase thickness (μm)
Temperature (C) 120.160.
I 783.792.
ReferenceBogoslovsky, Anvaer, et al., 1978Bogoslovsky, Anvaer, et al., 1978
Comment MSDC-RI MSDC-RI

Phase change data

Data compiled as indicated in comments:
BS - Robert L. Brown and Stephen E. Stein
TRC - Thermodynamics Research Center, NIST Boulder Laboratories, Chris Muzny director

Quantity Value Units Method Reference Comment
Tboil433.7KN/AAldrich Chemical Company Inc., 1990BS
Tboil433.15KN/ASmith and Sprung, 1943Uncertainty assigned by TRC = 3. K; TRC

In addition to the Thermodynamics Research Center (TRC) data available from this site, much more physical and chemical property data is available from the following TRC products:

References

Lee, Lee, et al., 2006
Lee, S.-J.; Lee, J.-E.; Kim, H.-W.; Kim, S.-S.; Koh, K.-H., Development of Korean red wines using Vitis labrusca varieties: instrumental and sensory characterization, Food Chem., 2006, 94, 3, 385-393, https://doi.org/10.1016/j.foodchem.2004.11.035 . [all data]

Ledauphin, Saint-Clair, et al., 2004
Ledauphin, J.; Saint-Clair, J.-F.; Lablanquie, O.; Guichard, H.; Founier, N.; Guichard, E.; Barillier, D., Identification of trace volatile compounds in freshly distilled calvados and cognac using preparative separations coupled with gas chromatography-mass spectrometry, J. Agric. Food Chem., 2004, 52, 16, 5124-5134, https://doi.org/10.1021/jf040052y . [all data]

Charles, Martin, et al., 2000
Charles, M.; Martin, B.; Ginies, C.; Etievant, P.; Coste, G.; Guichard, E., Potent aroma compounds of two red wine vinegars, J. Agric. Food Chem., 2000, 48, 1, 70-77, https://doi.org/10.1021/jf9905424 . [all data]

Chung, 2000
Chung, H.Y., Volatile flavor components in red fermented soybean (Glycine max) curds, J. Agric. Food Chem., 2000, 48, 5, 1803-1809, https://doi.org/10.1021/jf991272s . [all data]

Chung, 1999
Chung, H.Y., Volatile components in fermented soybean (Glycine max) curds, J. Agric. Food Chem., 1999, 47, 7, 2690-2696, https://doi.org/10.1021/jf981166a . [all data]