Decanedioic acid

Phase change data

Data compiled as indicated in comments:
BS - Robert L. Brown and Stephen E. Stein
TRC - Thermodynamics Research Center, NIST Boulder Laboratories, Chris Muzny director
AC - William E. Acree, Jr., James S. Chickos
ALS - Hussein Y. Afeefy, Joel F. Liebman, and Stephen E. Stein
DH - Eugene S. Domalski and Elizabeth D. Hearing

Quantity Value Units Method Reference Comment
Tfus404.KN/ABerchiesi, 1981Uncertainty assigned by TRC = 0.4 K; TRC
Tfus405.KN/AKhetarpal, Lal, et al., 1980Uncertainty assigned by TRC = 1.5 K; TRC
Tfus404.0KN/ACingolani and Berchiesi, 1974Uncertainty assigned by TRC = 0.5 K; TRC
Tfus407.KN/AWynberg and Logothetis, 1956Uncertainty assigned by TRC = 2. K; TRC
Tfus406.9KN/ASoffer, Strauss, et al., 1947Uncertainty assigned by TRC = 1. K; TRC
Quantity Value Units Method Reference Comment
Δvap29.83kcal/molCGCRoux, Temprado, et al., 2005Based on data from 424. - 503. K.; AC
Quantity Value Units Method Reference Comment
Δsub38.4 ± 0.7kcal/molVDavies and Thomas, 1960ALS

Reduced pressure boiling point

Tboil (K) Pressure (atm) Reference Comment
546.20.066Aldrich Chemical Company Inc., 1990BS
568.20.132Weast and Grasselli, 1989BS

Enthalpy of vaporization

ΔvapH (kcal/mol) Temperature (K) Reference Comment
20.5471.Stull, 1947Based on data from 456. - 625. K.; AC

Antoine Equation Parameters

log10(P) = A − (B / (T + C))
    P = vapor pressure (atm)
    T = temperature (K)

View plot Requires a JavaScript / HTML 5 canvas capable browser.

Temperature (K) A B C Reference Comment
456. - 625.410.980659061.541198.202Stull, 1947Coefficents calculated by NIST from author's data.

Enthalpy of sublimation

ΔsubH (kcal/mol) Temperature (K) Method Reference Comment
43. ± 2.353. - 385.TPDCappa, Lovejoy, et al., 2007AC
35.01302. - 320.TPTDChattopadhyay and Ziemann, 2005Values based on TPTD method are not consistent with values determined by other experimental methods; AC
38.41 ± 0.60389.MEDavies and Thomas, 1960Based on data from 375. - 403. K. See also Cox and Pilcher, 1970 and Stephenson and Malanowski, 1987.; AC

Enthalpy of fusion

ΔfusH (kcal/mol) Temperature (K) Method Reference Comment
9.7531404.0N/ACingolani and Berchiesi, 1974DH
11.2405.7N/AVentolà, Bayés, et al., 2008AC
10.8405.6DSCXia, Zhang, et al., 2008AC
11.1403.9N/ARoux, Temprado, et al., 2005AC
9.75404.N/ADomalski and Hearing, 1996AC

Entropy of fusion

ΔfusS (cal/mol*K) Temperature (K) Reference Comment
24.14404.0Cingolani and Berchiesi, 1974DH

In addition to the Thermodynamics Research Center (TRC) data available from this site, much more physical and chemical property data is available from the following TRC products:

References

Berchiesi, 1981
Berchiesi, M.A., Int. DATA Ser., Sel. Data Mixtures, Ser. A, 1981, No. 2, 126. [all data]

Khetarpal, Lal, et al., 1980
Khetarpal, S.C.; Lal, K.; Bhatnagar, H.I., Indian J. Chem., Sect. A:Inorg., Phys., Theor. Anal., 1980, 19A, 516. [all data]

Cingolani and Berchiesi, 1974
Cingolani, A.; Berchiesi, G., Thermodynamic properties of organic compounds. 1. A DSC study of phase transitions in aliphatic dicarboxylic acids, J. Therm. Anal., 1974, 6, 87-90. [all data]

Wynberg and Logothetis, 1956
Wynberg, H.; Logothetis, A., Studies in the Synthesis of Long-chain Compounds, J. Am. Chem. Soc., 1956, 78, 1958. [all data]

Soffer, Strauss, et al., 1947
Soffer, M.D.; Strauss, N.S.; Trail, M.D.; Sherk, K.W., J. Am. Chem. Soc., 1947, 69, 1684. [all data]

Roux, Temprado, et al., 2005
Roux, Maria Victoria; Temprado, Manuel; Chickos, James S., Vaporization, fusion and sublimation enthalpies of the dicarboxylic acids from C4 to C14 and C16, The Journal of Chemical Thermodynamics, 2005, 37, 9, 941-953, https://doi.org/10.1016/j.jct.2004.12.011 . [all data]

Davies and Thomas, 1960
Davies, M.; Thomas, G.H., The lattice energies, infra-red spectra, and possible cyclization of some dicarboxylic acids, Trans. Faraday Soc., 1960, 56, 185. [all data]

Aldrich Chemical Company Inc., 1990
Aldrich Chemical Company Inc., Catalog Handbook of Fine Chemicals, Aldrich Chemical Company, Inc., Milwaukee WI, 1990, 1. [all data]

Weast and Grasselli, 1989
CRC Handbook of Data on Organic Compounds, 2nd Editon, Weast,R.C and Grasselli, J.G., ed(s)., CRC Press, Inc., Boca Raton, FL, 1989, 1. [all data]

Stull, 1947
Stull, Daniel R., Vapor Pressure of Pure Substances. Organic and Inorganic Compounds, Ind. Eng. Chem., 1947, 39, 4, 517-540, https://doi.org/10.1021/ie50448a022 . [all data]

Cappa, Lovejoy, et al., 2007
Cappa, Christopher D.; Lovejoy, Edward R.; Ravishankara, A.R., Determination of Evaporation Rates and Vapor Pressures of Very Low Volatility Compounds: A Study of the C 4 -C 10 and C 12 Dicarboxylic Acids, J. Phys. Chem. A, 2007, 111, 16, 3099-3109, https://doi.org/10.1021/jp068686q . [all data]

Chattopadhyay and Ziemann, 2005
Chattopadhyay, Sulekha; Ziemann, Paul J., Vapor Pressures of Substituted and Unsubstituted Monocarboxylic and Dicarboxylic Acids Measured Using an Improved Thermal Desorption Particle Beam Mass Spectrometry Method, Aerosol Science and Technology, 2005, 39, 11, 1085-1100, https://doi.org/10.1080/02786820500421547 . [all data]

Cox and Pilcher, 1970
Cox, J.D.; Pilcher, G., Thermochemistry of Organic and Organometallic Compounds, Academic Press Inc., London, 1970, 643. [all data]

Stephenson and Malanowski, 1987
Stephenson, Richard M.; Malanowski, Stanislaw, Handbook of the Thermodynamics of Organic Compounds, 1987, https://doi.org/10.1007/978-94-009-3173-2 . [all data]

Ventolà, Bayés, et al., 2008
Ventolà, Lourdes; Bayés, Laura; Benages, Raül; Novegil-Anleo, Francisco Javier; Cuevas-Diarte, Miquel Ángel; Calvet, Teresa; Mondieig, Denise, Decanedioic Acid (C 10 H 18 O 4 )/Dodecanedioic Acid (C 12 H 22 O 4 ) System: Polymorphism of the Components and Experimental Phase Diagram, HCA, 2008, 91, 7, 1286-1298, https://doi.org/10.1002/hlca.200890140 . [all data]

Xia, Zhang, et al., 2008
Xia, Qing; Zhang, Feng-Bao; Zhang, Guo-Liang; Ma, Jian-Cheng; Zhao, Lei, Solubility of Sebacic Acid in Binary Water + Ethanol Solvent Mixtures, J. Chem. Eng. Data, 2008, 53, 3, 838-840, https://doi.org/10.1021/je7005314 . [all data]

Domalski and Hearing, 1996
Domalski, Eugene S.; Hearing, Elizabeth D., Heat Capacities and Entropies of Organic Compounds in the Condensed Phase. Volume III, J. Phys. Chem. Ref. Data, 1996, 25, 1, 1, https://doi.org/10.1063/1.555985 . [all data]