Chloromethane-d3

Gas phase ion energetics data

Data compiled by: Henry M. Rosenstock, Keith Draxl, Bruce W. Steiner, and John T. Herron

Ionization energy determinations

IE (eV) Method Reference
11.30PIKrauss, Walker, et al., 1968

Appearance energy determinations

Ion AE (eV) Other Products MethodReferenceComment
CD3+13.8ClPIKrauss, Walker, et al., 1968

Vibrational and/or electronic energy levels

Data compiled by: Takehiko Shimanouchi

Symmetry:   C     Symmetry Number σ = 3

 Sym.   No   Approximate   Selected Freq.  Infrared   Raman   Comments
 Species   type of mode   Value   Rating   Value  Phase  Value  Phase

a1 1 CD3 s-str 2160  A 2160.28 S gas
a1 2 CD3 s-deform 1029  A 1028.7 S gas
a1 3 CCl str 701  A 701.4 S gas
e 4 CD3 d-str 2283  A 2283.3 S gas
e 5 CD3 d-deform 1060  A 1059.9 M gas
e 6 CD3 rock 768  A 767.6 M gas

Source: Shimanouchi, 1972

References

Krauss, Walker, et al., 1968
Krauss, M.; Walker, J.A.; Dibeler, V.H., Mass spectrometric study of photoionization. X. Hydrogen chloride and methyl halides, J. Res. NBS, 1968, 72A, 281. [all data]

Shimanouchi, 1972
Shimanouchi, T., Tables of Molecular Vibrational Frequencies Consolidated Volume I, National Bureau of Standards, 1972, 1-160. [all data]