8-(Hydroxymethyl)-6-chloro-2-oxo-2H-1-benzopyran-3-carboxylic acid, ethyl ester

Phase change data

Data compiled by: William E. Acree, Jr., James S. Chickos

Enthalpy of fusion

ΔfusH (kJ/mol) Temperature (K) Method Reference
22.47424.DSCHuang, Zhou, et al., 1992

References

Huang, Zhou, et al., 1992
Huang, W.; Zhou, Y.; Tan, F.; Xu, G.; Hu, Y.; Hu, H., 8-Hydroxymethylcoumarin derivatives. II. DSC study of phase transitions, Huaxue Wuli Xuebao, 1992, 5, 3, 178. [all data]