C2H5As

Gas phase ion energetics data

Data compiled by: John E. Bartmess

De-protonation reactions

C2H4As- + Hydrogen cation = C2H5As

By formula: C2H4As- + H+ = C2H5As

Quantity Value Units Method Reference Comment
Δr353.5 ± 2.2kcal/molG+TSGuillemin, Decouzon, et al., 1997gas phase
Quantity Value Units Method Reference Comment
Δr346.1 ± 2.1kcal/molIMREGuillemin, Decouzon, et al., 1997gas phase

References

Guillemin, Decouzon, et al., 1997
Guillemin, J.C.; Decouzon, M.; Maria, P.C.; Gal, J.F.; Mo, O.; Yanez, M., Gas-phase basicities and acidities of ethyl-, vinyl, and ethynylarsine. An experimental and theoretical study, J. Phys. Chem. A, 1997, 101, 9525. [all data]