1,1'':1',1'''-Biferrocene

Gas phase ion energetics data

Data compiled by: Sharon G. Lias, Rhoda D. Levin, and Sherif A. Kafafi

Ionization energy determinations

IE (eV) Method Reference Comment
6.55PEBohm, Gleiter, et al., 1980Vertical value

References

Bohm, Gleiter, et al., 1980
Bohm, M.C.; Gleiter, R.; Delgado-Pena, F.; Cowan, D.O., Photoelectron spectra of biferrocenylene and biferrocene, Inorg. Chem., 1980, 19, 1081. [all data]