Dicadmium

Gas phase ion energetics data

Data compiled by: Sharon G. Lias and Joel F. Liebman

Ionization energy determinations

IE (eV) Method Reference
7.8PIRuppel and Rademann, 1992

References

Ruppel and Rademann, 1992
Ruppel, M.; Rademann, K., Abundance distributions and ionziation potentials of neutral cadmium clusters Cdx (x ≤50), Chem. Phys. Lett., 1992, 197, 280. [all data]