tetrakis(1,1,1,5,5,5-hexafluoro-2,4-pentanedionato)neptunium(IV)

Phase change data

Data compiled by: William E. Acree, Jr., James S. Chickos

Enthalpy of sublimation

ΔsubH (kcal/mol) Temperature (K) Reference Comment
19. ± 0.7314. - 375.Grebenshchikov, Sidorenko, et al., 1988See also Grebenshchikov, Sidorenko, et al., 1987.

References

Grebenshchikov, Sidorenko, et al., 1988
Grebenshchikov, N.R.; Sidorenko, G.V.; Suglobov, D.N.; Shcherbakova, L.L.; Adamov, V.M., Volatile β-diketonates of neptunium(IV) and (VI), Inorganica Chimica Acta, 1988, 145, 2, 315-325, https://doi.org/10.1016/S0020-1693(00)83976-6 . [all data]

Grebenshchikov, Sidorenko, et al., 1987
Grebenshchikov, N.R.; Sidorenko, G.V.; Suglobov, D.N., Radiokhimiya, 1987, 29, 296. [all data]