Bisabolol oxide

Normal alkane RI, non-polar column, temperature ramp

View large format table.

Column type Active phase I Reference Comment
CapillaryHP-5MS1652.Ferhat, Tigrine-Kordjani, et al., 200730. m/0.25 mm/0.25 μm, He, 60. C @ 8. min, 2. K/min, 250. C @ 15. min
CapillaryHP-5 MS1652.Tigrine-Kordiani, Meklati, et al., 200630. m/0.25 mm/0.25 μm, Helium, 60. C @ 8. min, 2. K/min, 250. C @ 15. min
CapillaryHP-5MS1635.Tesevic, Nikicevic, et al., 200530. m/0.25 mm/0.25 μm, He, 4.3 K/min; Tstart: 60. C; Tend: 285. C
CapillaryDB-51652.Juteau, Jerkovic, et al., 200350. m/0.2 mm/0.25 μm, He, 50. C @ 2. min, 3. K/min, 220. C @ 10. min

Normal alkane RI, non-polar column, custom temperature program

View large format table.

Column type Active phase I Reference Comment
CapillaryDB-51655.de Andrade, Bezerra, et al., 200430. m/0.25 mm/0.25 μm, He; Program: 35C => 4C/min => 180C => 10C/min => 280C

Normal alkane RI, polar column, temperature ramp

View large format table.

Column type Active phase I Reference Comment
CapillaryCarbowax2133.Ferhat, Tigrine-Kordjani, et al., 200760. m/0.2 mm/0.25 μm, He, 60. C @ 8. min, 2. K/min, 250. C @ 15. min
CapillaryCarbowax-PEG2133.Tigrine-Kordiani, Meklati, et al., 200660. m/0.20 mm/0.25 μm, Helium, 60. C @ 8. min, 2. K/min, 250. C @ 15. min
CapillaryHP-20M2084.Juteau, Jerkovic, et al., 200350. m/0.2 mm/0.2 μm, He, 70. C @ 4. min, 4. K/min, 180. C @ 10. min

Normal alkane RI, polar column, custom temperature program

View large format table.

Column type Active phase I Reference Comment
CapillaryInnowax FSC2156.Iscan, Kirimer, et al., 200660. m/0.25 mm/0.25 μm, N2; Program: 60C(10min) => 4C/min => 220C(10min) => 1C/min => 240C
CapillaryInnowax2162.Baser, Kürkcüoglu, et al., 199860. m/0.25 mm/0.25 μm; Program: 60C(10min) => 4C/min => 220C(10min) => 1C/min => 240C

References

Ferhat, Tigrine-Kordjani, et al., 2007
Ferhat, M.A.; Tigrine-Kordjani, N.; Chemat, S.; Meklati, B.Y.; Chemat, F., Rapid Extraction of Volatile Compounds Using a New Simultaneous Microwave Distillation: Solvent Extraction Device, Chromatographia, 2007, 65, 3-4, 217-222, https://doi.org/10.1365/s10337-006-0130-5 . [all data]

Tigrine-Kordiani, Meklati, et al., 2006
Tigrine-Kordiani, N.; Meklati, B.Y.; Chemat, F., Abalysis by gas chromatography - mass spectrometry of the essential oil of Zygophyllum album L., an aromatic and medicinal plant growing in Algeria, Int. J. Aromatherapy, 2006, 16, 3-4, 187-191, https://doi.org/10.1016/j.ijat.2006.09.008 . [all data]

Tesevic, Nikicevic, et al., 2005
Tesevic, V.; Nikicevic, N.; Jovanovic, A.; Djokovic, D.; Vujisic, L.; Vuckovic, I.; Bonic, M., Volatile components from old plum brandies, Food Technol. Biotechnol., 2005, 43, 4, 367-372. [all data]

Juteau, Jerkovic, et al., 2003
Juteau, F.; Jerkovic, I.; Masotti, V.; Milos, M.; Mastelic, J.; Bessière, J.-M.; Viano, J., Composition and antimicrobial activity of the essential oil of Artemisia absinthium from Croatia and France, Planta Medica, 2003, 69, 2, 158-161, https://doi.org/10.1055/s-2003-37714 . [all data]

de Andrade, Bezerra, et al., 2004
de Andrade, I.L.; Bezerra, J.N.S.; Lima, M.A.A.; de Faria, R.A.P.G.; Lima, M.A.S.; Andrade-Neto, M., Chemical composition and insecticidal activity of essential oils from Vanillosmopsis pohlii baker against Bemisia argentifolii, J. Agric. Food Chem., 2004, 52, 19, 5879-5881, https://doi.org/10.1021/jf049788l . [all data]

Iscan, Kirimer, et al., 2006
Iscan, G.; Kirimer, N.; Kurkcuoglu, M.; Arabaci, T.; Kupeli, E.; Baser, K.H.C., Biological Activity and Composition of the Essential Oils of Achillea schischkinii Sosn. and Achillea aleppica DC. subsp. aleppica, J. Agric. Food Chem., 2006, 54, 1, 170-173, https://doi.org/10.1021/jf051644z . [all data]

Baser, Kürkcüoglu, et al., 1998
Baser, K.H.C.; Kürkcüoglu, M.; Aytac, Z., Composition of the essential oil of Salvia euphratica Montbret ex Bentham var. euphratica from Turkey, Flavour Fragr. J., 1998, 13, 1, 63-64, https://doi.org/10.1002/(SICI)1099-1026(199801/02)13:1<63::AID-FFJ694>3.0.CO;2-Z . [all data]