2H-Pyran, 3,4-dihydro-

Normal alkane RI, polar column, custom temperature program

Data compiled by: NIST Mass Spectrometry Data Center, William E. Wallace, director

Column type Capillary
Active phase Carbowax 20M
Column length (m)
Carrier gas
Substrate
Column diameter (mm)
Phase thickness (μm)
Program not specified
I 982.
ReferenceVinogradov, 2004
Comment MSDC-RI

Gas phase thermochemistry data

Data compiled as indicated in comments:
ALS - Hussein Y. Afeefy, Joel F. Liebman, and Stephen E. Stein
GT - Glushko Thermocenter, Russian Academy of Sciences, Moscow

Quantity Value Units Method Reference Comment
Δfgas-26.96 ± 0.22kcal/molCcrSteele, Chirico, et al., 1989ALS

Constant pressure heat capacity of gas

Cp,gas (cal/mol*K) Temperature (K) Reference Comment
8.31350.Dorofeeva O.V., 1992p=1 bar.; GT
10.06100.
12.28150.
15.03200.
20.10273.15
22.03 ± 0.84298.15
22.17300.
29.964400.
36.960500.
42.818600.
47.674700.
51.730800.
55.146900.
58.0451000.
60.5141100.
62.6241200.
64.4381300.
65.9991400.
67.3491500.

Condensed phase thermochemistry data

Data compiled by: Hussein Y. Afeefy, Joel F. Liebman, and Stephen E. Stein

Quantity Value Units Method Reference Comment
Δfliquid-35.31 ± 0.21kcal/molCcrSteele, Chirico, et al., 1989
Quantity Value Units Method Reference Comment
Δcliquid-708.21 ± 0.19kcal/molCcrSteele, Chirico, et al., 1989Corresponding Δfliquid = -35.308 kcal/mol (simple calculation by NIST; no Washburn corrections)

Reaction thermochemistry data

Data compiled by: Hussein Y. Afeefy, Joel F. Liebman, and Stephen E. Stein

Individual Reactions

2H-Pyran, 3,4-dihydro- + Hydrogen = Tetrahydropyran

By formula: C5H8O + H2 = C5H10O

Quantity Value Units Method Reference Comment
Δr-24.69 ± 0.24kcal/molChydAllinger, Glaser, et al., 1981liquid phase; solvent: Hexane

Normal alkane RI, non-polar column, custom temperature program

Data compiled by: NIST Mass Spectrometry Data Center, William E. Wallace, director

Column type CapillaryCapillary
Active phase VF-5SE-30
Column length (m) 30.
Carrier gas Helium
Substrate
Column diameter (mm) 0.25
Phase thickness (μm) 0.25
Program 50 0C (2 min) 3 0C/min -> 200 0C (3 min) 10 0C/min -> 220 0C (8 min)not specified
I 668.705.
ReferenceShivashankar, Roy, et al., 2012Vinogradov, 2004
Comment MSDC-RI MSDC-RI

References

Vinogradov, 2004
Vinogradov, B.A., Production, composition, properties and application of essential oils, 2004, retrieved from http://viness.narod.ru. [all data]