Trisilver dibromide

Gas phase ion energetics data

Data compiled by: Sharon G. Lias, Rhoda D. Levin, and Sherif A. Kafafi

Ionization energy determinations

IE (eV) Method Reference
10.0 ± 0.2EIVisnapuu and Marek, 1971

References

Visnapuu and Marek, 1971
Visnapuu, A.; Marek, B.C., Properties of silver bromide vapors, J. Less-Common Met., 1971, 25, 89. [all data]