Pt3

Vibrational and/or electronic energy levels

Data compiled by: Marilyn E. Jacox

State:   A?

 Energy
 (cm-1
 Med.   Transition   λmin
 (nm)
 λmax
 (nm)

Gas phase ion energetics data

Data compiled by: John E. Bartmess

Electron affinity determinations

EA (eV) Method Reference Comment
1.870 ± 0.020LPESErvin, Ho, et al., 1988

References

To = 1225 ± 30 gas Ervin, Ho, et al., 1988

Vib.
sym.
 No.   Approximate
 type of mode
 cm-1   Med.   Method   References

180 T gas PE Ervin, Ho, et al., 1988

State:   X

Vib.
sym.
 No.   Approximate
 type of mode
 cm-1   Med.   Method   References

Sym. stretch 225 ± 30 T gas PE Ervin, Ho, et al., 1988
Bend 105 ± 30 gas PE Ervin, Ho, et al., 1988

Additional references: Jacox, 1994, page 61

Ervin, Ho, et al., 1988
Ervin, K.M.; Ho, J.; Lineberger, W.C., Electronic and Vibrational Structure of Transition Metal Trimers: Photoelectron Spectra of Ni3-, Pd3- and Pt3-, J. Chem. Phys., 1988, 89, 8, 4514, https://doi.org/10.1063/1.454791 . [all data]

Jacox, 1994
Jacox, M.E., Vibrational and electronic energy levels of polyatomic transient molecules, American Chemical Society, Washington, DC, 1994, 464. [all data]