Tetrairidiumdodecacarbonyl

Phase change data

Data compiled by: William E. Acree, Jr., James S. Chickos

Quantity Value Units Method Reference Comment
Δsub105. ± 20.kJ/molN/APilcher and Skinner, 1983See also Connor, Skinner, et al., 1973.

References

Pilcher and Skinner, 1983
Pilcher, G.; Skinner, H.A., Thermochemistry of organometallic compounds, 1983, 43-90, https://doi.org/10.1002/9780470771686.ch2 . [all data]

Connor, Skinner, et al., 1973
Connor, J.A.; Skinner, H.A.; Virmani, Y., High temperature microcalorimetric studies of the thermal decomposition and iodination of polynuclear carbonyls of Fe, Co, Ru, Rh, Re, Os and Ir, Faraday Symp. Chem. Soc., 1973, 8, 18, https://doi.org/10.1039/fs9730800018 . [all data]