PtN radical

Gas phase ion energetics data

Data compiled by: John E. Bartmess

Electron affinity determinations

EA (eV) Method Reference Comment
<2.02714 ± 0.00043LPESMurray, Lykke, et al., 1987May be considerably above EA

References

Murray, Lykke, et al., 1987
Murray, K.K.; Lykke, K.R.; Lineberger, W.C., Spectroscopy and Autodetachment Dynamics of PtN-, Phys. Rev. A, 1987, 36, 2, 699, https://doi.org/10.1103/PhysRevA.36.699 . [all data]