Sorbic Acid

Condensed phase thermochemistry data

Data compiled by: Hussein Y. Afeefy, Joel F. Liebman, and Stephen E. Stein

Quantity Value Units Method Reference Comment
Δcliquid-3125.8kJ/molCcbLemoult, 1904Corresponding Δfliquid = -378.6 kJ/mol (simple calculation by NIST; no Washburn corrections)
Quantity Value Units Method Reference Comment
Δcsolid-3123.kJ/molCcbFischer and Wrede, 1904Heat of combustion corrected for pressure; Corresponding Δfsolid = -381. kJ/mol (simple calculation by NIST; no Washburn corrections)

References

Lemoult, 1904
Lemoult, M.P., Remarques sur une serie recenie de determinations calorimetriques, Compt. Rend., 1904, 663-635. [all data]

Fischer and Wrede, 1904
Fischer, E.; Wrede, F., Uber die Verbrennungswarme einiger organischer Verbindungen, Sitzungsber. Dtsch. Akad. Wiss. Berlin Kl. Math. Phys. Tech., 1904, 687-715. [all data]

Timmons, 1966
Timmons, C.J., UV atlas of organic compouds, 1966, 1, B7/1. [all data]