octyl hydrogen sulphate

Condensed phase thermochemistry data

Data compiled by: Hussein Y. Afeefy, Joel F. Liebman, and Stephen E. Stein

Quantity Value Units Method Reference Comment
Δfliquid-232. ± 1.kcal/molCmMarkitanova, Barsukov, et al., 1981Sulfation

References

Markitanova, Barsukov, et al., 1981
Markitanova, L.I.; Barsukov, I.I.; Passet, B.V., Determination of heat of sulfation by calorimetric titration, J. Gen. Chem. USSR, 1981, 51, 1286-1289. [all data]