Benzoic acid, 4,4'-carbonylbis[2-[(phenylamino)carbonyl]-

Reaction thermochemistry data

Data compiled by: Hussein Y. Afeefy, Joel F. Liebman, and Stephen E. Stein

Individual Reactions

C21H16N2O4 + Phthalic anhydride = C29H20N2O7

By formula: C21H16N2O4 + C8H4O3 = C29H20N2O7

Quantity Value Units Method Reference Comment
Δr-31. ± 0.4kJ/molEqkKaryakin, Rabinovich, et al., 1978liquid phase; solvent: DMF

References

Karyakin, Rabinovich, et al., 1978
Karyakin, N.V.; Rabinovich, I.B.; Pal'tseva, N.G., Thermodynamics of the reactions of aromatic diamines with dianhydrides of tetracarboxylic acids, Polym. Sci. USSR, 1978, 20, 2274-2279. [all data]