3-Hydroxy-6-Tigloyloxytropane

Van Den Dool and Kratz RI, non-polar column, custom temperature program

Data compiled by: NIST Mass Spectrometry Data Center, William E. Wallace, director

Column type CapillaryCapillary
Active phase HP-5MSHP-5MS
Column length (m) 30.30.
Carrier gas He
Substrate
Column diameter (mm) 0.250.25
Phase thickness (μm) 0.250.25
Program 60C (1 min) => 5 C/min => 210C => 10 C/min => 280C (15 min)not specified
I 1905.81839.
ReferenceAndriamaharavo, 2014Humam, Munoz, et al., 2007
Comment MSDC-RI MSDC-RI

References

Andriamaharavo, 2014
Andriamaharavo, N.R., Retention Data. NIST Mass Spectrometry Data Center., NIST Mass Spectrometry Data Center, 2014. [all data]

Humam, Munoz, et al., 2007
Humam, M.; Munoz, O.; Christen, P.; Hostettmann, K., Tropane alkaloids of the aerial part of Schizanthus tricolor, Nat. Prod. Commun., 2007, 2, 7, 743-747. [all data]